{"text_format":"1","workbook":"xlsx","n_sheets":12,"sheets":["0. Guide","1. Info","2. P&L","3. CF","4. Bilan & ratios","5. Investissements","6. Dette","7. Graphes","8. Données Graphes (ARAFER)","9. Checks (ARAFER)","10. Bridge 2015 (ARAFER)","11. Bridge 2016 (ARAFER)"],"not_rendered":{"charts":6,"images":4,"macros":1,"external_links":0,"defined_names":9,"comments":0,"pivot_tables":0},"unopened":[],"bounds":{"document_bytes":16777216,"sheet_cells":100000,"rows_first":2000,"rows_last":500,"rows_between":2000,"halvings":0,"cell_chars":16384,"cell_head_chars":4096},"cells_cut":0,"cells_raw":0,"read":"whole","date_system":"1900"}

{"sheet":"0. Guide","index":0,"n_rows":28,"n_cols":2,"rows_kept":28,"cut":false,"hidden":false,"merged":[[20,1,20,8],[23,0,23,8],[25,0,25,8],[16,0,16,8],[27,0,27,8],[21,1,21,8],[9,1,9,8],[10,1,10,8],[11,1,11,8],[18,1,18,8],[19,1,19,8],[12,1,12,8],[0,1,0,8],[3,0,3,8],[6,1,6,8],[7,1,7,8],[8,1,8,8]]}
[null,"Annexe 2 - Etude financière\n(décision n°2017-047 du 24 mai 2017)"]
[]
["Objet de l'étude financière"]
["Ce modèle d'étude finanière est celui devant être utilisé par les sociétés concessionnaires dans le cadre de la décision n°2017-47"]
[]
["Structure du fichier"]
["Onglet \"1. Info\"","Identification des caractéristiques de la société, du format des données renseignées et de l'auteur de l'étude"]
["Onglet \"2. P&L\"","Permet de présenter le compte de résultat avec des détail pour certains postes de recettes et de dépenses"]
["Onglet \"3. CF\"","Permet de présenter les principaux flux de trésorerie"]
["Onglet \"4. Bilan & ratio\"","Permet de présenter les principaux éléments de bilan\nLes ratios sont calculés automatiquement selon une méthodologie harmonisée par l'Autorité"]
["Onglet \"5. Investissements\"","Permet d'identifier les dépenses d'investissement effectives et prévisionnelles\nPour les investissements de développement, le détail est demandé par opération sur la durée de l'opération\nPour les investissements de renouvellement et de maintenance, le détail est demandé pour les deux derniers exercices écoulés et pour les cinq prochains exercices. Au-delà, la prévision est demandée de manière agglomérée."]
["Onglet \"6. Dette\"","Permet d'identifier les instruments de dette de la société et leurs caractéristiques"]
["Onglet \"7. Graphes\"","Permet de visualiser les évolutions des principaux agrégats"]
[]
["Règles de remplissage"]
["Principe de remplissage"]
["Les onglets 1 à 6 sont à renseigner.\nLes onglets 2 à 5 doivent comporter :\n- pour les années écoulées : le réalisé et à nouveau le prévisionnel des exercices N-2 (2015) et N-1 (2016) conformément aux données tranmises en septembre 2016 selon la nouvelle granularité. Pour les années à venir seules les données concernant le réalisé N-1 seront demandées.\n- pour les années à venir : les prévisions actualisées"]
["Code couleur dur remplissage "]
[null,"Donnée à saisir"]
[null,"Donnée à saisir (facultative)"]
[null,"Donnée calculée Total (non modifiable)"]
[null,"Donnée calculée  (non modifiable)"]
["Format des données "]
["Les données doivent être saisies en M€ courants. Les données sont à renseigner pour toutes les années.\nLes produits/encaissements sont saisis en  positif et les charges/décaissements sont saisies en négatif (i.e. avec un signe -)."]
["Aide à la saisie"]
["Pour chacun des onglets, une colonne d'aide à la saisie a été créée pour préciser, le cas échéant, la nature des données attendues."]
["Contrôle de cohérence"]
["Pour certaiens lignes, un contrôle de cohérence est effectué. La mention \"CHECK\" s'affiche en rouge en cas d'erreur, la mention \"OK\" en l'absence d'erreur.\nLe fichier doit être transmis avec toutes les cellules de contrôle sur \"OK\"."]

{"sheet":"1. Info","index":1,"n_rows":26,"n_cols":30,"rows_kept":26,"cut":false,"hidden":false,"merged":[[1,1,1,4],[23,6,25,6]]}
[]
[null,"INFORMATIONS SUR L'ETUDE FINANCIERE",null,null,null,null,"Aide à la saisie"]
[]
[]
[null,null,"Nom de la société",null,null,null,"Pour les SCA concernées, remplir par contrat et par société (ex : Cofiroute 3 fichiers)",null,null,null,null,null,null,null,null,null,null,null,null,null,null,null,"ADELAC",null,"Social - French Gaap",null,1,null,"oui","Conseil d'Administration"]
[null,null,null,null,null,null,null,null,null,null,null,null,null,null,null,null,null,null,null,null,null,null,"ALBEA",null,"Conso - IFRS Gaap",null,2,null,"non","Comité Exécutif"]
[null,null,"Format des données réelles communiquées","Social - French Gaap",null,null,null,null,null,null,null,null,null,null,null,null,null,null,null,null,null,null,"ALICORNE",null,"Modèle financier",null,null,null,null,"Président"]
[null,null,"Format des données prévisionnelles communiquées","Modèle financier",null,null,"Modèle financier correspond à des données issues du modèle financier prévisionnel de la société.\nReporting analytique correspond à des données extraites du reporting de la société et répartie selon la comptabilité analytique",null,null,null,null,null,null,null,null,null,null,null,null,null,null,null,"A'LIENOR",null,"Reporting analytique",null,null,null,null,"Directeur Général"]
[null,null,null,null,null,null,null,null,null,null,null,null,null,null,null,null,null,null,null,null,null,null,"ALIS",null,null,null,null,null,null,"Directeur Financier"]
[null,null,"Nb de concession(s) simulée(s)",2,null,null,"Pour les sociétés possédant plusieurs concessions, inscrire en complément le détail du P&L par concession jusqu'à l'Ebit dans l'onglet P&L",null,null,null,null,null,null,null,null,null,null,null,null,null,null,null,"APRR"]
[null,null,null,null,null,null,null,null,null,null,null,null,null,null,null,null,null,null,null,null,null,null,"ARCOUR"]
[null,null,"Date de mise à jour des prévisions","2015-12-31",null,null,null,null,null,null,null,null,null,null,null,null,null,null,null,null,null,null,"AREA"]
[null,null,null,null,null,null,null,null,null,null,null,null,null,null,null,null,null,null,null,null,null,null,"ASF"]
[null,null,"Validation officielle","oui",null,null,"Les données transmises à l'Arafer doivent doivent avoir dans la mesure du possible un caractère officiel pour la société",null,null,null,null,null,null,null,null,null,null,null,null,null,null,null,"ATLANDES"]
[null,null,"Si, oui Date de validation",null,null,null,null,null,null,null,null,null,null,null,null,null,null,null,null,null,null,null,"ATMB - Société"]
[null,null,"Si oui, désignation de l'approbateur",null,null,null,null,null,null,null,null,null,null,null,null,null,null,null,null,null,null,null,"ATMB - Concession A40"]
[null,null,null,null,null,null,null,null,null,null,null,null,null,null,null,null,null,null,null,null,null,null,"CEVM"]
[null,null,"Référent du document",null,null,null,null,null,null,null,null,null,null,null,null,null,null,null,null,null,null,null,"Cofiroute société"]
[null,null,"Nom",null,null,null,null,null,null,null,null,null,null,null,null,null,null,null,null,null,null,null,"Cofiroute - Concession interurbaine"]
[null,null,"Adresse mail",null,null,null,null,null,null,null,null,null,null,null,null,null,null,null,null,null,null,null,"Cofiroute - Concession A86"]
[null,null,"N° téléphone (ligne directe)",null,null,null,null,null,null,null,null,null,null,null,null,null,null,null,null,null,null,null,"Escota"]
[null,null,null,null,null,null,null,null,null,null,null,null,null,null,null,null,null,null,null,null,null,null,"Sanef"]
[null,null,"Matérialité des données en %",null,null,null,null,null,null,null,null,null,null,null,null,null,null,null,null,null,null,null,"SAPN"]
[null,null,"Compte de Résultat ( en % de EBITDA)",{"$f":"2%*50%","v":0.01},null,null,null,null,null,null,null,null,null,null,null,null,null,null,null,null,null,null,"SFTRF - Société"]
[null,null,"Tableau de Cash Flow ( en % de EBITDA)",{"$f":"2%*50%","v":0.01},null,null,null,null,null,null,null,null,null,null,null,null,null,null,null,null,null,null,"SFTRF - Concession A43"]
[null,null,"Bilan ( en % Total actif)",{"$f":"2%*50%","v":0.01}]

{"sheet":"2. P&L","index":2,"n_rows":234,"n_cols":80,"rows_kept":234,"cut":false,"hidden":false,"merged":[[28,0,28,79],[2,0,2,79],[114,0,114,79],[175,0,175,79],[112,0,112,79]]}
[{"$f":"'1. Info'!$D$5","v":0}]
[]
["Indices / Evolutions"]
[]
[null,"Aide à la saisie","Commentaires SCA",null,"Checks","2015 (p)","2015 (r)","2016 (p)","2016 (r)","2017 (p)","2018 (p)","2019 (p)","2020 (p)","2021 (p)","2022 (p)","2023 (p)","2024 (p)","2025 (p)","2026 (p)","2027 (p)","2028 (p)","2029 (p)","2030 (p)","2031 (p)","2032 (p)","2033 (p)","2034 (p)","2035 (p)","2036 (p)","2037 (p)","2038 (p)","2039 (p)","2040 (p)","2041 (p)","2042 (p)","2043 (p)","2044 (p)","2045 (p)","2046 (p)","2047 (p)","2048 (p)","2049 (p)","2050 (p)","2051 (p)","2052 (p)","2053 (p)","2054 (p)","2055 (p)","2056 (p)","2057 (p)","2058 (p)","2059 (p)","2060 (p)","2061 (p)","2062 (p)","2063 (p)","2064 (p)","2065 (p)","2066 (p)","2067 (p)","2068 (p)","2069 (p)","2070 (p)","2071 (p)","2072 (p)","2073 (p)","2074 (p)","2075 (p)","2076 (p)","2077 (p)","2078 (p)","2079 (p)","2080 (p)","2081 (p)","2082 (p)","2083 (p)","2084 (p)","2085 (p)","2086 (p)","2087 (p)"]
["Prix "]
["Evolution inflation utilisée dans la loi tarifaire en %","Evolution de l'inflation sur 1 an servant au calcul de loi tarifaire accordée le 1er février de chaque année.\nPréciser la/les source(s)"]
["Evolution inflation générale en %","Evolution annuelle globale de l'inflation impactant en particulier les coûts d'exploitation.\nPréciser la/les source(s)."]
["Evolution TP01 en %","Evolution de l'indice des prix du secteur des travaux publics retenue dans les prévisions"]
["Evolution TP09 en %","Evolution de l'indice des prix pour la fabrication et la mise en œuvre d'enrobés retenue dans les prévisions"]
[]
["Trafics"]
["Evolution Trafic  en % réseau payant","Evolution du trafic VL + PL sur le réseau payant du domaine concédé"]
["Evolution Trafic VL en % réseau payant","Evolution du trafic VL sur le réseau payant du domaine concédé"]
["Evolution Trafic PL en % réseau payant","Evolution du trafic PL sur le réseau payant du domaine concédé"]
[]
["Tarifs"]
["Evolution tarifs théorique Classe 1 en %","Evolution issue de la formule tarifaire théorique définie par le cahier des charges de la concession et impactant la classe 1"]
["Evolution tarifs théorique Classe 2 en %","Evolution issue de la formule tarifaire théorique définie par le cahier des charges de la concession et impactant la classe 2"]
["Evolution tarifs théorique Classe 3 en %","Evolution issue de la formule tarifaire théorique définie par le cahier des charges de la concession et impactant la classe 3"]
["Evolution tarifs théorique Classe 4 en %","Evolution issue de la formule tarifaire théorique définie par le cahier des charges de la concession et impactant la classe 4"]
["Evolution tarifs théorique Classe 5 en %","Evolution issue de la formule tarifaire théorique définie par le cahier des charges de la concession et impactant la classe 5"]
[]
["Evolution réelle tarifs en %","Evolution réelle des tarifs (VL+PL) sur l'année (01/01 au 31/12) tenant compte des hausses du 01/02/n-1 et du 01/02/n"]
["Evolution réelle tarifs VL en %","Evolution réelle des tarifs VL sur l'année (01/01 au 31/12) tenant compte des hausses du 01/02/n-1 et du 01/02/n"]
["Evolution réelle tarifs PL en %","Evolution réelle des tarifs PL sur l'année (01/01 au 31/12) tenant compte des hausses du 01/02/n-1 et du 01/02/n"]
[]
[]
["Compte de résultat société"]
[]
["( en M€ courants )  ","Aide à la saisie","Commentaires SCA","Ref liasse Fiscale quand applicable - Formulaire Cerfa n°2052 et 2053 ","Checks","2015 (p)","2015 (r)","2016 (p)","2016 (r)","2017 (p)","2018 (p)","2019 (p)","2020 (p)","2021 (p)","2022 (p)","2023 (p)","2024 (p)","2025 (p)","2026 (p)","2027 (p)","2028 (p)","2029 (p)","2030 (p)","2031 (p)","2032 (p)","2033 (p)","2034 (p)","2035 (p)","2036 (p)","2037 (p)","2038 (p)","2039 (p)","2040 (p)","2041 (p)","2042 (p)","2043 (p)","2044 (p)","2045 (p)","2046 (p)","2047 (p)","2048 (p)","2049 (p)","2050 (p)","2051 (p)","2052 (p)","2053 (p)","2054 (p)","2055 (p)","2056 (p)","2057 (p)","2058 (p)","2059 (p)","2060 (p)","2061 (p)","2062 (p)","2063 (p)","2064 (p)","2065 (p)","2066 (p)","2067 (p)","2068 (p)","2069 (p)","2070 (p)","2071 (p)","2072 (p)","2073 (p)","2074 (p)","2075 (p)","2076 (p)","2077 (p)","2078 (p)","2079 (p)","2080 (p)","2081 (p)","2082 (p)","2083 (p)","2084 (p)","2085 (p)","2086 (p)","2087 (p)"]
["CHIFFRES D'AFFAIRES",null,null,"FL",null,{"$f":"+F33+F40","v":0},0,0,0,0,0,0,0,0,0,0,0,0,0,0,0,0,0,0,0,{"$f":"+Z33+Z40","v":0},0,0,0,0,0,0,0,0,0,0,0,0,0,0,0,0,0,0,0,0,0,0,0,0,0,0,0,0,0,0,0,0,0,0,0,0,0,0,0,0,0,0,0,0,0,0,0,0,0,0,0,0,0,{"$f":"+CB33+CB40","v":0}]
["Chiffre d'Affaires péage","CA péage net",null,null,null,{"$f":"SUM(F34:F35)","v":0},{"$f":"SUM(G34:G35)","v":0},{"$f":"SUM(H34:H35)","v":0},0,0,0,0,0,0,0,0,0,0,0,0,0,0,0,0,0,{"$f":"SUM(Z34:Z35)","v":0},0,0,0,0,0,0,0,0,0,0,0,0,0,0,0,0,0,0,0,0,0,0,0,0,0,0,0,0,0,0,0,0,0,0,0,0,0,0,0,0,0,0,0,0,0,0,0,0,0,0,0,0,0,{"$f":"SUM(CB34:CB35)","v":0}]
["CA Péage VL"]
["CA Péage PL"]
["% Evolution",null,null,null,null,null,null,{"$f":"IFERROR(H33/F33-1,\"\")","v":""},"",{"$f":"IFERROR(J33/I33-1,\"\")","v":""},"","","","","","","","","","","","","","","",{"$f":"IFERROR(Z33/Y33-1,\"\")","v":""},{"$f":"IFERROR(AA33/Z33-1,\"\")","v":""},{"$f":"IFERROR(AB33/AA33-1,\"\")","v":""},{"$f":"IFERROR(AC33/AB33-1,\"\")","v":""},{"$f":"IFERROR(AD33/AC33-1,\"\")","v":""},{"$f":"IFERROR(AE33/AD33-1,\"\")","v":""},{"$f":"IFERROR(AF33/AE33-1,\"\")","v":""},{"$f":"IFERROR(AG33/AF33-1,\"\")","v":""},{"$f":"IFERROR(AH33/AG33-1,\"\")","v":""},{"$f":"IFERROR(AI33/AH33-1,\"\")","v":""},{"$f":"IFERROR(AJ33/AI33-1,\"\")","v":""},{"$f":"IFERROR(AK33/AJ33-1,\"\")","v":""},{"$f":"IFERROR(AL33/AK33-1,\"\")","v":""},{"$f":"IFERROR(AM33/AL33-1,\"\")","v":""},{"$f":"IFERROR(AN33/AM33-1,\"\")","v":""},{"$f":"IFERROR(AO33/AN33-1,\"\")","v":""},{"$f":"IFERROR(AP33/AO33-1,\"\")","v":""},{"$f":"IFERROR(AQ33/AP33-1,\"\")","v":""},{"$f":"IFERROR(AR33/AQ33-1,\"\")","v":""},{"$f":"IFERROR(AS33/AR33-1,\"\")","v":""},{"$f":"IFERROR(AT33/AS33-1,\"\")","v":""},{"$f":"IFERROR(AU33/AT33-1,\"\")","v":""},{"$f":"IFERROR(AV33/AU33-1,\"\")","v":""},{"$f":"IFERROR(AW33/AV33-1,\"\")","v":""},{"$f":"IFERROR(AX33/AW33-1,\"\")","v":""},{"$f":"IFERROR(AY33/AX33-1,\"\")","v":""},{"$f":"IFERROR(AZ33/AY33-1,\"\")","v":""},{"$f":"IFERROR(BA33/AZ33-1,\"\")","v":""},{"$f":"IFERROR(BB33/BA33-1,\"\")","v":""},{"$f":"IFERROR(BC33/BB33-1,\"\")","v":""},{"$f":"IFERROR(BD33/BC33-1,\"\")","v":""},{"$f":"IFERROR(BE33/BD33-1,\"\")","v":""},{"$f":"IFERROR(BF33/BE33-1,\"\")","v":""},{"$f":"IFERROR(BG33/BF33-1,\"\")","v":""},{"$f":"IFERROR(BH33/BG33-1,\"\")","v":""},{"$f":"IFERROR(BI33/BH33-1,\"\")","v":""},{"$f":"IFERROR(BJ33/BI33-1,\"\")","v":""},{"$f":"IFERROR(BK33/BJ33-1,\"\")","v":""},{"$f":"IFERROR(BL33/BK33-1,\"\")","v":""},{"$f":"IFERROR(BM33/BL33-1,\"\")","v":""},{"$f":"IFERROR(BN33/BM33-1,\"\")","v":""},{"$f":"IFERROR(BO33/BN33-1,\"\")","v":""},{"$f":"IFERROR(BP33/BO33-1,\"\")","v":""},{"$f":"IFERROR(BQ33/BP33-1,\"\")","v":""},{"$f":"IFERROR(BR33/BQ33-1,\"\")","v":""},{"$f":"IFERROR(BS33/BR33-1,\"\")","v":""},{"$f":"IFERROR(BT33/BS33-1,\"\")","v":""},{"$f":"IFERROR(BU33/BT33-1,\"\")","v":""},{"$f":"IFERROR(BV33/BU33-1,\"\")","v":""},{"$f":"IFERROR(BW33/BV33-1,\"\")","v":""},{"$f":"IFERROR(BX33/BW33-1,\"\")","v":""},{"$f":"IFERROR(BY33/BX33-1,\"\")","v":""},{"$f":"IFERROR(BZ33/BY33-1,\"\")","v":""},{"$f":"IFERROR(CA33/BZ33-1,\"\")","v":""},""]
["dont CA net VL",null,null,null,null,null,null,"","",{"$f":"IFERROR(J34/I34-1,\"\")","v":""},"","","","","","","","","","","","","","","","","","","","","","","","","","","","","","","","","","","","","","","","","","","","","","","","","","","","","","","","","","","","","","","","","","","","","",""]
["dont CA net PL",null,null,null,null,null,null,"","",{"$f":"IFERROR(J35/I35-1,\"\")","v":""},"","","","","","","","","","","","","","","","","","","","","","","","","","","","","","","","","","","","","","","","","","","","","","","","","","","","","","","","","","","","","","","","","","","","","",""]
["Check Evolution du CA péage","Vérification que le CA péage correspond bien à la somme du CA péage par classe.\nSi le check est rouge, revoir le détail du CA péage.",null,null,{"$f":"'9. Checks (ARAFER)'!E11","v":"OK"}]
["Revenus des activités annexes",null,null,null,null,{"$f":"SUM(F41:F43)","v":0},0,0,0,0,0,0,0,0,0,0,0,0,0,0,0,0,0,0,0,{"$f":"SUM(Z41:Z43)","v":0},0,0,0,0,0,0,0,0,0,0,0,0,0,0,0,0,0,0,0,0,0,0,0,0,0,0,0,0,0,0,0,0,0,0,0,0,0,0,0,0,0,0,0,0,0,0,0,0,0,0,0,0,0,{"$f":"SUM(CB41:CB43)","v":0}]
[" Redevances des installations commerciales"]
[" Redevances des installations de télécommunication","Locations de fibres optiques et pylones aux opérateurs télécoms"]
[" Autres éléments du chiffre d'affaires","Exemple : Vente dépannage carburant, commissions TIS VL, prestations d'ingénierie, prestations d'exploitation et de sécurité pour tiers  (collectivités locales, autre SCA), frais de gestion des badges liber-t, mise à disposition de personel pour tiers. \nDétails à  préciser en commentaires."]
["AUTRES REVENUS D'EXPLOITATION",null,null,"Σ FM à FQ",null,null,{"$f":"SUM(G45:G48)","v":0},null,0]
["Production immobilisée",null,null,"FN"]
["Remboursement accidents"]
["Subventions d'exploitation",null,null,"FO"]
["Autres produits d'exploitation","Montants correspondant aux comptes 72/74 et 75 du PCG.\nDétailler le contenu en commentaires.\nNe pas netter avec les autres charges d'exploitation",null,"FM + FP + FQ"]
["CHARGES D'EXPLOITATION",null,null,null,null,{"$f":"F50+F62+F68+F75","v":0},0,0,0,0,0,0,0,0,0,0,0,0,0,0,0,0,0,0,0,{"$f":"Z50+Z62+Z68+Z75","v":0},0,0,0,0,0,0,0,0,0,0,0,0,0,0,0,0,0,0,0,0,0,0,0,0,0,0,0,0,0,0,0,0,0,0,0,0,0,0,0,0,0,0,0,0,0,0,0,0,0,0,0,0,0,{"$f":"CB50+CB62+CB68+CB75","v":0}]
["Achats et charges externes",null,null,"Σ FS à FW",null,{"$f":"+F51+F52+F56+F57+F60","v":0},0,0,0,0,0,0,0,0,0,0,0,0,0,0,0,0,0,0,0,{"$f":"+Z51+Z52+Z56+Z57+Z60","v":0},0,0,0,0,0,0,0,0,0,0,0,0,0,0,0,0,0,0,0,0,0,0,0,0,0,0,0,0,0,0,0,0,0,0,0,0,0,0,0,0,0,0,0,0,0,0,0,0,0,0,0,0,0,{"$f":"+CB51+CB52+CB56+CB57+CB60","v":0}]
["Energie, achats stockés et consommables","Dépenses liées au carburant, électricité, eau, sel et pièces détachées"]
["Gros entretien sur infrastructures","Le check vérifie que le total est égal au détail",null,null,{"$f":"'9. Checks (ARAFER)'!E16","v":"OK"},null,{"$f":"SUM(G53:G55)","v":0},null,0]
["dont gros entretien sur chaussées ","Charge comptabilisée (OPEX)"]
["dont gros entretien sur ouvrages d'art","Charge comptabilisée (OPEX)"]
["dont autre gros entretien"]
["Entretien courant","Entretien matériel péage, réparations accidents et autre entretien"]
["Redevance domaniale","Le check vérifie que le total est égal au détail",null,null,{"$f":"'9. Checks (ARAFER)'!E18","v":"OK"},{"$f":"+SUM(F58:F59)","v":0},0,0,0,0,0,0,0,0,{"$f":"+SUM(O58:O59)","v":0},0,0,0,0,0,0,0,0,0,0,{"$f":"+SUM(Z58:Z59)","v":0},0,0,0,0,0,0,0,0,0,0,0,0,0,0,0,0,0,0,0,0,0,0,0,0,0,0,0,0,0,0,0,0,0,0,0,0,0,0,0,0,0,0,0,0,0,0,0,0,0,0,0,0,0,{"$f":"+SUM(CB58:CB59)","v":0}]
["Charge redevance domaniale brute comptabilisée","Montant brut calculé (vision comptable)"]
["Remboursement reçu de l'Etat au titre de la redevance domaniale ","Montant remboursé par l'Etat suite négociations. \nSeules les nouvelles SCA sont concernées. \nAttention, il s'agit d'un produit ! Doit apparaître avec un signe '+'"]
["Autres prestations et charges externes"]
["dont contrat d'exploitation","Concerne uniquement les SCA pour lesquelles l'exploitation fait l'objet d'un contrat spécifique auprès d'un prestataire externe"]
["Charges de personnel (yc participation et CICE)",null,null,null,null,null,{"$f":"SUM(G63:G67)","v":0},null,0]
["Salaires et traitements","Inscrire uniquement la masse salariale liée aux effectifs propres de la SCA. \nSi la SCA n'a aucun effectif, incrire 0.",null,"FY"]
["Charges sociales et engagements sociaux différés","Ne sont à prendre en compte que les provisions pour engagements sociaux différés non exceptionnels (IFC, CATS, congés payés, CET…) hors plan de départ"]
["Intéressement, abondement du plan d'épargne et participation","La participation est réintégrée dans cette ligne "]
["CICE","S'agissant d'un produit, le montant doit apparaître en positif"]
["Autres charges de personnel","Préciser les autres postes significatifs (comme par ex. la formation, l'habillage et la visite médicale)"]
["Impôts et taxes",null,null,"FX",null,{"$f":"+F69+F72+F73+F74","v":0},0,0,0,0,0,0,0,0,0,0,0,0,0,0,0,0,0,0,0,{"$f":"+Z69+Z72+Z73+Z74","v":0},0,0,0,0,0,0,0,0,0,0,0,0,0,0,0,0,0,0,0,0,0,0,0,0,0,0,0,0,0,0,0,0,0,0,0,0,0,0,0,0,0,0,0,0,0,0,0,0,0,0,0,0,0,{"$f":"+CB69+CB72+CB73+CB74","v":0}]
["TAT","Le check vérifie que le total est égal au détail",null,null,{"$f":"'9. Checks (ARAFER)'!E20","v":"OK"},{"$f":"SUM(F70:F71)","v":0},0,0,0,0,0,0,0,0,0,0,0,0,0,0,0,0,0,0,0,{"$f":"SUM(Z70:Z71)","v":0},0,0,0,0,0,0,0,0,0,0,0,0,0,0,0,0,0,0,0,0,0,0,0,0,0,0,0,0,0,0,0,0,0,0,0,0,0,0,0,0,0,0,0,0,0,0,0,0,0,0,0,0,0,{"$f":"SUM(CB70:CB71)","v":0}]
["Charge TAT brute comptabilisée","Montant brut calculé et payé"]
["Remboursement reçu de l'Etat au titre de la TAT","Montant remboursé par l'Etat suite négociations. \nSeules les nouvelles SCA sont concernées. \nAttention, il s'agit d'un produit ! Doit apparaître avec un signe '+'"]
["CET"]
["CVE"]
["Autres impôts et taxes","Hors redevance domaniale"]
["Autres charges d'exploitation","Montants correspondant aux comptes 65 du PCG.\nNe pas netter avec les autres produits d'exploitation de la ligne 51",null,"GE"]
["EBITDA","Notion non définie dans les French Gaap correspondant au solde entre CA + Autres revenus d'exploitation et les charges d'exploitaion (hors dotations aux amortissements et provisions).\nA la différence de l'EBE, l'EBITDA prend en compte la participation des salariés et les autres charges d'exploitation",null,null,null,{"$f":"F32+F44+F49","v":0},0,0,0,0,0,0,0,0,0,0,0,0,0,0,0,0,0,0,0,{"$f":"Z32+Z44+Z49","v":0},0,0,0,0,0,0,0,0,0,0,0,0,0,0,0,0,0,0,0,0,0,0,0,0,0,0,0,0,0,0,0,0,0,0,0,0,0,0,0,0,0,0,0,0,0,0,0,0,0,0,0,0,0,{"$f":"CB32+CB44+CB49","v":0}]
["marge Ebitda",null,null,null,null,{"$f":"IFERROR(F76/F32,\"\")","v":""},"","","","","","","","","","","","","","","","","","","",{"$f":"IFERROR(Z76/Z32,\"\")","v":""},"","","","","","","","","","","","","","","","","","","","","","","","","","","","","","","","","","","","","","","","","","","","","","","","","","","","","",{"$f":"IFERROR(CB76/CB32,\"\")","v":""}]
["Dotations aux amortissements",null,null,"GA",null,{"$f":"+F79+F80","v":0},{"$f":"+G79+G80","v":0},0,0,0,0,0,0,0,0,0,0,0,0,0,0,0,0,0,0,{"$f":"+Z79+Z80","v":0},0,0,0,0,0,0,0,0,0,0,0,0,0,0,0,0,0,0,0,0,0,0,0,0,0,0,0,0,0,0,0,0,0,0,0,0,0,0,0,0,0,0,0,0,0,0,0,0,0,0,0,0,0,{"$f":"+CB79+CB80","v":0}]
["Dotations aux amortissements des immobilisations non renouvelables","Correspond à l'amortissement de caducité"]
["Dotations aux amortissements des immobilisations renouvelables","Correspond à l'amortissement technique des immobilisations d'exploitation et à l'amortissement des immobilisation incorporelles"]
["Autres dotations aux amort. et prov. (net reprises)","Le check vérifie que le total est égal au détail",null,"GC + GD",{"$f":"'9. Checks (ARAFER)'!E22","v":"OK"},null,{"$f":"SUM(G82:G85)","v":0},null,0]
["dont provision / reprise pour renouvellement des couches de chaussées","si reprise, montant positif '+' car produit"]
["dont provision / reprise pour maintien en état des ouvrages d'art","si reprise, montant positif '+' car produit"]
["dont provision / reprise exceptionnelle liée à la masse salariale","si reprise, montant positif '+' car produit"]
["dont autres provisions / reprises d'exploitation","si reprise, montant positif '+' car produit"]
["Reprises des subventions d'investissement","Attention, il s'agit d'un produit ! Doit apparaître avec un signe '+'"]
["EBIT",null,null,"GG + HJ",null,{"$f":"F76+F78+F81+F86","v":0},0,0,0,0,0,0,0,0,0,0,0,0,0,0,0,0,0,0,0,0,0,0,0,0,0,0,0,0,0,0,0,0,0,0,0,0,0,0,0,0,0,0,0,0,0,0,0,0,0,0,0,0,0,0,0,0,0,0,0,0,0,0,0,{"$f":"BR76+BR78+BR81+BR86","v":0},0,0,0,0,0,0,0,0,0,0]
[]
["PRODUITS FINANCIERS",null,null,"GP",null,{"$f":"+F90+F93+F94","v":0},{"$f":"+G90+G93+G94","v":0},{"$f":"+H90+H93+H94","v":0},{"$f":"+I90+I93+I94","v":0},{"$f":"+J90+J93+J94","v":0},{"$f":"+K90+K93+K94","v":0},{"$f":"+L90+L93+L94","v":0},{"$f":"+M90+M93+M94","v":0},{"$f":"+N90+N93+N94","v":0},{"$f":"+O90+O93+O94","v":0},{"$f":"+P90+P93+P94","v":0},{"$f":"+Q90+Q93+Q94","v":0},{"$f":"+R90+R93+R94","v":0},{"$f":"+S90+S93+S94","v":0},{"$f":"+T90+T93+T94","v":0},{"$f":"+U90+U93+U94","v":0},{"$f":"+V90+V93+V94","v":0},{"$f":"+W90+W93+W94","v":0},{"$f":"+X90+X93+X94","v":0},{"$f":"+Y90+Y93+Y94","v":0},0,0,0,0,0,0,0,0,0,0,0,0,0,0,0,0,0,0,0,0,0,0,0,0,0,0,0,0,0,0,0,0,0,0,0,0,0,0,0,0,0,0,0,0,0,0,0,0,0,0,0,0,0,0,{"$f":"+CB90+CB93+CB94","v":0}]
["Dividendes reçus","Dividendes provenant de filiales consolidées ou mises en équivalence",null,"GJ"]
["dont provenant de SCA françaises"]
["dont provenant d'autres filiales françaises ou étrangères"]
["Intérêts sur créances",null,null,"GK"]
["Autres produits financiers","Préciser le détail en particulier les produits sur dérivés",null,"Σ GL à GO"]
["CHARGES FINANCIERES",null,null,"GU",null,{"$f":"+F96+F98","v":0},0,0,0,0,0,0,0,0,0,0,0,0,0,0,0,0,0,0,0,{"$f":"+Z96+Z98","v":0},0,0,0,0,0,0,0,0,0,0,0,0,0,0,0,0,0,0,0,0,0,0,0,0,0,0,0,0,0,0,0,0,0,0,0,0,0,0,0,0,0,0,0,0,0,0,0,0,0,0,0,0,0,{"$f":"+CB96+CB98","v":0}]
["Charges financières sur emprunts",null,null,"GR"]
["dont prime (soulte) sur opération de refinancement"]
["Autres charges financières","Préciser le détail en particulier les charges sur dérivés",null,"GQ + GS + GT"]
["RESULTAT FINANCIER",null,null,"GV",null,{"$f":"F89+F95","v":0},0,0,0,0,0,0,0,0,0,0,0,0,0,0,0,0,0,0,0,{"$f":"Z89+Z95","v":0},0,0,0,0,0,0,0,0,0,0,0,0,0,0,0,0,0,0,0,0,0,0,0,0,0,0,0,0,0,0,0,0,0,0,0,0,0,0,0,0,0,0,0,0,0,0,0,0,0,0,0,0,0,{"$f":"CB89+CB95","v":0}]
["Taux intérêt implicite",null,null,null,null,{"$f":"IFERROR(-F96/AVERAGE('4. Bilan & ratios'!F40,'4. Bilan & ratios'!#REF!),\"\")","v":""},null,{"$f":"IFERROR(-H96/AVERAGE('4. Bilan & ratios'!H40,'4. Bilan & ratios'!G40),\"\")","v":""},{"$f":"IFERROR(-I96/AVERAGE('4. Bilan & ratios'!I40,'4. Bilan & ratios'!G40),\"\")","v":""},{"$f":"IFERROR(-J96/AVERAGE('4. Bilan & ratios'!J40,'4. Bilan & ratios'!I40),\"\")","v":""},{"$f":"IFERROR(-K96/AVERAGE('4. Bilan & ratios'!K40,'4. Bilan & ratios'!J40),\"\")","v":""},{"$f":"IFERROR(-L96/AVERAGE('4. Bilan & ratios'!L40,'4. Bilan & ratios'!K40),\"\")","v":""},{"$f":"IFERROR(-M96/AVERAGE('4. Bilan & ratios'!M40,'4. Bilan & ratios'!L40),\"\")","v":""},{"$f":"IFERROR(-N96/AVERAGE('4. Bilan & ratios'!N40,'4. Bilan & ratios'!M40),\"\")","v":""},{"$f":"IFERROR(-O96/AVERAGE('4. Bilan & ratios'!O40,'4. Bilan & ratios'!N40),\"\")","v":""},{"$f":"IFERROR(-P96/AVERAGE('4. Bilan & ratios'!P40,'4. Bilan & ratios'!O40),\"\")","v":""},{"$f":"IFERROR(-Q96/AVERAGE('4. Bilan & ratios'!Q40,'4. Bilan & ratios'!P40),\"\")","v":""},{"$f":"IFERROR(-R96/AVERAGE('4. Bilan & ratios'!R40,'4. Bilan & ratios'!Q40),\"\")","v":""},{"$f":"IFERROR(-S96/AVERAGE('4. Bilan & ratios'!S40,'4. Bilan & ratios'!R40),\"\")","v":""},{"$f":"IFERROR(-T96/AVERAGE('4. Bilan & ratios'!T40,'4. Bilan & ratios'!S40),\"\")","v":""},{"$f":"IFERROR(-U96/AVERAGE('4. Bilan & ratios'!U40,'4. Bilan & ratios'!T40),\"\")","v":""},{"$f":"IFERROR(-V96/AVERAGE('4. Bilan & ratios'!V40,'4. Bilan & ratios'!U40),\"\")","v":""},{"$f":"IFERROR(-W96/AVERAGE('4. Bilan & ratios'!W40,'4. Bilan & ratios'!V40),\"\")","v":""},{"$f":"IFERROR(-X96/AVERAGE('4. Bilan & ratios'!X40,'4. Bilan & ratios'!W40),\"\")","v":""},{"$f":"IFERROR(-Y96/AVERAGE('4. Bilan & ratios'!Y40,'4. Bilan & ratios'!X40),\"\")","v":""},{"$f":"IFERROR(-Z96/AVERAGE('4. Bilan & ratios'!Z40,'4. Bilan & ratios'!Y40),\"\")","v":""},{"$f":"IFERROR(-AA96/AVERAGE('4. Bilan & ratios'!AA40,'4. Bilan & ratios'!Z40),\"\")","v":""},{"$f":"IFERROR(-AB96/AVERAGE('4. Bilan & ratios'!AB40,'4. Bilan & ratios'!AA40),\"\")","v":""},{"$f":"IFERROR(-AC96/AVERAGE('4. Bilan & ratios'!AC40,'4. Bilan & ratios'!AB40),\"\")","v":""},{"$f":"IFERROR(-AD96/AVERAGE('4. Bilan & ratios'!AD40,'4. Bilan & ratios'!AC40),\"\")","v":""},{"$f":"IFERROR(-AE96/AVERAGE('4. Bilan & ratios'!AE40,'4. Bilan & ratios'!AD40),\"\")","v":""},{"$f":"IFERROR(-AF96/AVERAGE('4. Bilan & ratios'!AF40,'4. Bilan & ratios'!AE40),\"\")","v":""},{"$f":"IFERROR(-AG96/AVERAGE('4. Bilan & ratios'!AG40,'4. Bilan & ratios'!AF40),\"\")","v":""},{"$f":"IFERROR(-AH96/AVERAGE('4. Bilan & ratios'!AH40,'4. Bilan & ratios'!AG40),\"\")","v":""},{"$f":"IFERROR(-AI96/AVERAGE('4. Bilan & ratios'!AI40,'4. Bilan & ratios'!AH40),\"\")","v":""},{"$f":"IFERROR(-AJ96/AVERAGE('4. Bilan & ratios'!AJ40,'4. Bilan & ratios'!AI40),\"\")","v":""},{"$f":"IFERROR(-AK96/AVERAGE('4. Bilan & ratios'!AK40,'4. Bilan & ratios'!AJ40),\"\")","v":""},{"$f":"IFERROR(-AL96/AVERAGE('4. Bilan & ratios'!AL40,'4. Bilan & ratios'!AK40),\"\")","v":""},{"$f":"IFERROR(-AM96/AVERAGE('4. Bilan & ratios'!AM40,'4. Bilan & ratios'!AL40),\"\")","v":""},{"$f":"IFERROR(-AN96/AVERAGE('4. Bilan & ratios'!AN40,'4. Bilan & ratios'!AM40),\"\")","v":""},{"$f":"IFERROR(-AO96/AVERAGE('4. Bilan & ratios'!AO40,'4. Bilan & ratios'!AN40),\"\")","v":""},{"$f":"IFERROR(-AP96/AVERAGE('4. Bilan & ratios'!AP40,'4. Bilan & ratios'!AO40),\"\")","v":""},{"$f":"IFERROR(-AQ96/AVERAGE('4. Bilan & ratios'!AQ40,'4. Bilan & ratios'!AP40),\"\")","v":""},{"$f":"IFERROR(-AR96/AVERAGE('4. Bilan & ratios'!AR40,'4. Bilan & ratios'!AQ40),\"\")","v":""},{"$f":"IFERROR(-AS96/AVERAGE('4. Bilan & ratios'!AS40,'4. Bilan & ratios'!AR40),\"\")","v":""},{"$f":"IFERROR(-AT96/AVERAGE('4. Bilan & ratios'!AT40,'4. Bilan & ratios'!AS40),\"\")","v":""},{"$f":"IFERROR(-AU96/AVERAGE('4. Bilan & ratios'!AU40,'4. Bilan & ratios'!AT40),\"\")","v":""},{"$f":"IFERROR(-AV96/AVERAGE('4. Bilan & ratios'!AV40,'4. Bilan & ratios'!AU40),\"\")","v":""},{"$f":"IFERROR(-AW96/AVERAGE('4. Bilan & ratios'!AW40,'4. Bilan & ratios'!AV40),\"\")","v":""},{"$f":"IFERROR(-AX96/AVERAGE('4. Bilan & ratios'!AX40,'4. Bilan & ratios'!AW40),\"\")","v":""},{"$f":"IFERROR(-AY96/AVERAGE('4. Bilan & ratios'!AY40,'4. Bilan & ratios'!AX40),\"\")","v":""},{"$f":"IFERROR(-AZ96/AVERAGE('4. Bilan & ratios'!AZ40,'4. Bilan & ratios'!AY40),\"\")","v":""},{"$f":"IFERROR(-BA96/AVERAGE('4. Bilan & ratios'!BA40,'4. Bilan & ratios'!AZ40),\"\")","v":""},{"$f":"IFERROR(-BB96/AVERAGE('4. Bilan & ratios'!BB40,'4. Bilan & ratios'!BA40),\"\")","v":""},{"$f":"IFERROR(-BC96/AVERAGE('4. Bilan & ratios'!BC40,'4. Bilan & ratios'!BB40),\"\")","v":""},{"$f":"IFERROR(-BD96/AVERAGE('4. Bilan & ratios'!BD40,'4. Bilan & ratios'!BC40),\"\")","v":""},{"$f":"IFERROR(-BE96/AVERAGE('4. Bilan & ratios'!BE40,'4. Bilan & ratios'!BD40),\"\")","v":""},{"$f":"IFERROR(-BF96/AVERAGE('4. Bilan & ratios'!BF40,'4. Bilan & ratios'!BE40),\"\")","v":""},{"$f":"IFERROR(-BG96/AVERAGE('4. Bilan & ratios'!BG40,'4. Bilan & ratios'!BF40),\"\")","v":""},{"$f":"IFERROR(-BH96/AVERAGE('4. Bilan & ratios'!BH40,'4. Bilan & ratios'!BG40),\"\")","v":""},{"$f":"IFERROR(-BI96/AVERAGE('4. Bilan & ratios'!BI40,'4. Bilan & ratios'!BH40),\"\")","v":""},{"$f":"IFERROR(-BJ96/AVERAGE('4. Bilan & ratios'!BJ40,'4. Bilan & ratios'!BI40),\"\")","v":""},{"$f":"IFERROR(-BK96/AVERAGE('4. Bilan & ratios'!BK40,'4. Bilan & ratios'!BJ40),\"\")","v":""},{"$f":"IFERROR(-BL96/AVERAGE('4. Bilan & ratios'!BL40,'4. Bilan & ratios'!BK40),\"\")","v":""},{"$f":"IFERROR(-BM96/AVERAGE('4. Bilan & ratios'!BM40,'4. Bilan & ratios'!BL40),\"\")","v":""},{"$f":"IFERROR(-BN96/AVERAGE('4. Bilan & ratios'!BN40,'4. Bilan & ratios'!BM40),\"\")","v":""},{"$f":"IFERROR(-BO96/AVERAGE('4. Bilan & ratios'!BO40,'4. Bilan & ratios'!BN40),\"\")","v":""},{"$f":"IFERROR(-BP96/AVERAGE('4. Bilan & ratios'!BP40,'4. Bilan & ratios'!BO40),\"\")","v":""},{"$f":"IFERROR(-BQ96/AVERAGE('4. Bilan & ratios'!BQ40,'4. Bilan & ratios'!BP40),\"\")","v":""},{"$f":"IFERROR(-BR96/AVERAGE('4. Bilan & ratios'!BR40,'4. Bilan & ratios'!BQ40),\"\")","v":""},{"$f":"IFERROR(-BS96/AVERAGE('4. Bilan & ratios'!BS40,'4. Bilan & ratios'!BR40),\"\")","v":""},{"$f":"IFERROR(-BT96/AVERAGE('4. Bilan & ratios'!BT40,'4. Bilan & ratios'!BS40),\"\")","v":""},{"$f":"IFERROR(-BU96/AVERAGE('4. Bilan & ratios'!BU40,'4. Bilan & ratios'!BT40),\"\")","v":""},{"$f":"IFERROR(-BV96/AVERAGE('4. Bilan & ratios'!BV40,'4. Bilan & ratios'!BU40),\"\")","v":""},{"$f":"IFERROR(-BW96/AVERAGE('4. Bilan & ratios'!BW40,'4. Bilan & ratios'!BV40),\"\")","v":""},{"$f":"IFERROR(-BX96/AVERAGE('4. Bilan & ratios'!BX40,'4. Bilan & ratios'!BW40),\"\")","v":""},{"$f":"IFERROR(-BY96/AVERAGE('4. Bilan & ratios'!BY40,'4. Bilan & ratios'!BX40),\"\")","v":""},{"$f":"IFERROR(-BZ96/AVERAGE('4. Bilan & ratios'!BZ40,'4. Bilan & ratios'!BY40),\"\")","v":""},{"$f":"IFERROR(-CA96/AVERAGE('4. Bilan & ratios'!CA40,'4. Bilan & ratios'!BZ40),\"\")","v":""},{"$f":"IFERROR(-CB96/AVERAGE('4. Bilan & ratios'!CB40,'4. Bilan & ratios'!CA40),\"\")","v":""}]
[]
["RESULTAT COURANT",null,null,"GW",null,{"$f":"+F87+F99","v":0},0,0,0,0,0,0,0,0,0,0,0,0,0,0,0,0,0,0,0,{"$f":"+Z87+Z99","v":0},0,0,0,0,0,0,0,0,0,0,0,0,0,0,0,0,0,0,0,0,0,0,0,0,0,0,0,0,0,0,0,0,0,0,0,0,0,0,0,0,0,0,0,0,0,0,0,0,0,0,0,0,0,{"$f":"+CB87+CB99","v":0}]
[]
["RESULTAT EXCEPTIONNEL","Hors reprises de subventions d'investissements"]
[]
["RESULTAT AVANT IMPOTS",null,null,null,null,{"$f":"+F102+F104","v":0},0,0,{"$f":"+I102+I104","v":0},0,0,0,0,0,0,0,0,0,0,0,0,0,0,0,0,{"$f":"+Z102+Z104","v":0},0,0,0,0,0,0,0,0,0,0,0,0,0,0,0,0,0,0,0,0,0,0,0,0,0,0,0,0,0,0,0,0,0,0,0,0,0,0,0,0,0,0,0,0,0,0,0,0,0,0,0,0,0,{"$f":"+CB102+CB104","v":0}]
["Impôt sur les sociétés","IS dû au titre de l'exercice",null,"HK"]
["RESULTAT NET",null,null,"HN",null,{"$f":"F106+F107","v":0},0,0,{"$f":"I106+I107","v":0},0,0,0,0,0,0,0,0,0,0,{"$f":"T106+T107","v":0},0,0,0,0,0,{"$f":"Z106+Z107","v":0},0,0,0,0,0,0,0,0,0,0,0,0,0,0,0,0,0,0,0,0,0,0,0,0,0,0,0,0,0,0,0,0,0,0,0,0,0,0,0,0,0,0,0,0,0,0,0,0,0,0,0,0,0,{"$f":"CB106+CB107","v":0}]
["marge nette",null,null,null,null,{"$f":"IFERROR(F108/F32,\"\")","v":""},"","","","","","","","","","","","","","","","","","","",{"$f":"IFERROR(Z108/Z32,\"\")","v":""},"","","","","","","","","","","","","","","","","","","","","","","","","","","","","","","","","","","","","","","","","","","","","","","","","","","","","",{"$f":"IFERROR(CB108/CB32,\"\")","v":""}]
[]
["Taux IS"]
[]
["Informations détaillées par concession pour les sociétés possédant 2 contrats de concession différents"]
[]
["Compte de résultat concession 1"]
[]
["( en M€ courants )  ","Aide à la saisie","Commentaires SCA","Ref liasse Fiscale quand applicable - Formulaire Cerfa n°2052 et 2053 ","Checks","2015 (p)","2015 (r)","2016 (p)","2016 (r)","2017 (p)","2018 (p)","2019 (p)","2020 (p)","2021 (p)","2022 (p)","2023 (p)","2024 (p)","2025 (p)","2026 (p)","2027 (p)","2028 (p)","2029 (p)","2030 (p)","2031 (p)","2032 (p)","2033 (p)","2034 (p)","2035 (p)","2036 (p)","2037 (p)","2038 (p)","2039 (p)","2040 (p)","2041 (p)","2042 (p)","2043 (p)","2044 (p)","2045 (p)","2046 (p)","2047 (p)","2048 (p)","2049 (p)","2050 (p)","2051 (p)","2052 (p)","2053 (p)","2054 (p)","2055 (p)","2056 (p)","2057 (p)","2058 (p)","2059 (p)","2060 (p)","2061 (p)","2062 (p)","2063 (p)","2064 (p)","2065 (p)","2066 (p)","2067 (p)","2068 (p)","2069 (p)","2070 (p)","2071 (p)","2072 (p)","2073 (p)","2074 (p)","2075 (p)","2076 (p)","2077 (p)","2078 (p)","2079 (p)","2080 (p)","2081 (p)","2082 (p)","2083 (p)","2084 (p)","2085 (p)","2086 (p)","2087 (p)"]
["CHIFFRES D'AFFAIRES",null,null,null,null,{"$f":"+F119+F126","v":0},0,0,0,0,0,0,0,0,0,0,0,0,0,0,0,0,0,0,0,{"$f":"+Z119+Z126","v":0},0,0,0,0,0,0,0,0,0,0,0,0,0,0,0,0,0,0,0,0,0,0,0,0,0,0,0,0,0,0,0,0,0,0,0,0,0,0,0,0,0,0,0,0,0,0,0,0,0,0,0,0,0,0]
["Chiffre d'Affaires péage","CA péage net",null,null,null,{"$f":"SUM(F120:F121)","v":0},{"$f":"SUM(G120:G121)","v":0},{"$f":"SUM(H120:H121)","v":0},0,0,0,0,0,0,0,0,0,0,0,0,0,0,0,0,0,{"$f":"SUM(Z120:Z121)","v":0},0,0,0,0,0,0,0,0,0,0,0,0,0,0,0,0,0,0,0,0,0,0,0,0,0,0,0,0,0,0,0,0,0,0,0,0,0,0,0,0,0,0,0,0,0,0,0,0,0,0,0,0,0,0]
["CA Péage VL"]
["CA Péage PL"]
["% Evolution",null,null,null,null,null,null,{"$f":"IFERROR(H119/F119-1,\"\")","v":""},{"$f":"IFERROR(I119/G119-1,\"\")","v":""},{"$f":"IFERROR(J119/I119-1,\"\")","v":""},{"$f":"IFERROR(K119/J119-1,\"\")","v":""},{"$f":"IFERROR(L119/K119-1,\"\")","v":""},{"$f":"IFERROR(M119/L119-1,\"\")","v":""},{"$f":"IFERROR(N119/M119-1,\"\")","v":""},{"$f":"IFERROR(O119/N119-1,\"\")","v":""},{"$f":"IFERROR(P119/O119-1,\"\")","v":""},{"$f":"IFERROR(Q119/P119-1,\"\")","v":""},{"$f":"IFERROR(R119/Q119-1,\"\")","v":""},{"$f":"IFERROR(S119/R119-1,\"\")","v":""},{"$f":"IFERROR(T119/S119-1,\"\")","v":""},{"$f":"IFERROR(U119/T119-1,\"\")","v":""},{"$f":"IFERROR(V119/U119-1,\"\")","v":""},{"$f":"IFERROR(W119/V119-1,\"\")","v":""},{"$f":"IFERROR(X119/W119-1,\"\")","v":""},{"$f":"IFERROR(Y119/X119-1,\"\")","v":""},{"$f":"IFERROR(Z119/Y119-1,\"\")","v":""},{"$f":"IFERROR(AA119/Z119-1,\"\")","v":""},{"$f":"IFERROR(AB119/AA119-1,\"\")","v":""},{"$f":"IFERROR(AC119/AB119-1,\"\")","v":""},{"$f":"IFERROR(AD119/AC119-1,\"\")","v":""},{"$f":"IFERROR(AE119/AD119-1,\"\")","v":""},{"$f":"IFERROR(AF119/AE119-1,\"\")","v":""},{"$f":"IFERROR(AG119/AF119-1,\"\")","v":""},{"$f":"IFERROR(AH119/AG119-1,\"\")","v":""},{"$f":"IFERROR(AI119/AH119-1,\"\")","v":""},{"$f":"IFERROR(AJ119/AI119-1,\"\")","v":""},{"$f":"IFERROR(AK119/AJ119-1,\"\")","v":""},{"$f":"IFERROR(AL119/AK119-1,\"\")","v":""},{"$f":"IFERROR(AM119/AL119-1,\"\")","v":""},{"$f":"IFERROR(AN119/AM119-1,\"\")","v":""},{"$f":"IFERROR(AO119/AN119-1,\"\")","v":""},{"$f":"IFERROR(AP119/AO119-1,\"\")","v":""},{"$f":"IFERROR(AQ119/AP119-1,\"\")","v":""},{"$f":"IFERROR(AR119/AQ119-1,\"\")","v":""},{"$f":"IFERROR(AS119/AR119-1,\"\")","v":""},{"$f":"IFERROR(AT119/AS119-1,\"\")","v":""},{"$f":"IFERROR(AU119/AT119-1,\"\")","v":""},{"$f":"IFERROR(AV119/AU119-1,\"\")","v":""},{"$f":"IFERROR(AW119/AV119-1,\"\")","v":""},{"$f":"IFERROR(AX119/AW119-1,\"\")","v":""},{"$f":"IFERROR(AY119/AX119-1,\"\")","v":""},{"$f":"IFERROR(AZ119/AY119-1,\"\")","v":""},{"$f":"IFERROR(BA119/AZ119-1,\"\")","v":""},{"$f":"IFERROR(BB119/BA119-1,\"\")","v":""},{"$f":"IFERROR(BC119/BB119-1,\"\")","v":""},{"$f":"IFERROR(BD119/BC119-1,\"\")","v":""},{"$f":"IFERROR(BE119/BD119-1,\"\")","v":""},{"$f":"IFERROR(BF119/BE119-1,\"\")","v":""},{"$f":"IFERROR(BG119/BF119-1,\"\")","v":""},{"$f":"IFERROR(BH119/BG119-1,\"\")","v":""},{"$f":"IFERROR(BI119/BH119-1,\"\")","v":""},{"$f":"IFERROR(BJ119/BI119-1,\"\")","v":""},{"$f":"IFERROR(BK119/BJ119-1,\"\")","v":""},{"$f":"IFERROR(BL119/BK119-1,\"\")","v":""},{"$f":"IFERROR(BM119/BL119-1,\"\")","v":""},{"$f":"IFERROR(BN119/BM119-1,\"\")","v":""},{"$f":"IFERROR(BO119/BN119-1,\"\")","v":""},{"$f":"IFERROR(BP119/BO119-1,\"\")","v":""},{"$f":"IFERROR(BQ119/BP119-1,\"\")","v":""},{"$f":"IFERROR(BR119/BQ119-1,\"\")","v":""},{"$f":"IFERROR(BS119/BR119-1,\"\")","v":""},{"$f":"IFERROR(BT119/BS119-1,\"\")","v":""},{"$f":"IFERROR(BU119/BT119-1,\"\")","v":""},{"$f":"IFERROR(BV119/BU119-1,\"\")","v":""},{"$f":"IFERROR(BW119/BV119-1,\"\")","v":""},{"$f":"IFERROR(BX119/BW119-1,\"\")","v":""},{"$f":"IFERROR(BY119/BX119-1,\"\")","v":""},{"$f":"IFERROR(BZ119/BY119-1,\"\")","v":""},{"$f":"IFERROR(CA119/BZ119-1,\"\")","v":""},{"$f":"IFERROR(CB119/CA119-1,\"\")","v":""}]
["dont CA net VL",null,null,null,null,null,null,"","","","","","","","","","","","","","","","","","","","","","","","","","","","","","","","","","","","","","","","","","","","","","","","","","","","","","","","","","","","","","","","","","","","","","","","",""]
["dont CA net PL",null,null,null,null,null,null,"","","","","","","","","","","","","","","","","","","","","","","","","","","","","","","","","","","","","","","","","","","","","","","","","","","","","","","","","","","","","","","","","","","","","","","","",""]
["Check Evolution du CA péage","Vérification que le CA péage correspond bien à la somme du CA péage par classe.\nSi le check est rouge, revoir le détail du CA péage.",null,null,{"$f":"'9. Checks (ARAFER)'!E12","v":"OK"}]
["Revenus des activités annexes",null,null,null,null,{"$f":"SUM(F127:F129)","v":0},0,0,0,0,0,0,0,0,0,0,0,0,0,0,0,0,0,0,0,{"$f":"SUM(Z127:Z129)","v":0},0,0,0,0,0,0,0,0,0,0,0,0,0,0,0,0,0,0,0,0,0,0,0,0,0,0,0,0,0,0,0,0,0,0,0,0,0,0,0,0,0,0,0,0,0,0,0,0,0,0,0,0,0,0]
[" Redevances des installations commerciales"]
[" Redevances des installations de télécommunication","Locations de fibres optiques et pylones aux opérateurs télécoms"]
[" Autres éléments du chiffre d'affaires","Exemple : Vente dépannage carburant, commissions TIS VL, prestations d'ingénierie, prestations d'exploitation et de sécurité pour tiers  (collectivités locales, autre SCA), frais de gestion des badges liber-t, mise à disposition de personel pour tiers. \nDétails à  préciser en commentaires."]
["AUTRES REVENUS D'EXPLOITATION",null,null,null,null,null,{"$f":"SUM(G131:G134)","v":0},null,{"$f":"SUM(I131:I134)","v":0}]
["Production immobilisée"]
["Remboursement accidents"]
["Subventions d'exploitation"]
["Autres produits d'exploitation","Montants correspondant aux comptes 72/74 et 75 du PCG.\nDétailler le contenu en commentaires.\nNe pas netter avec les autres charges d'exploitation"]
["CHARGES D'EXPLOITATION",null,null,null,null,{"$f":"F136+F148+F154+F161","v":0},0,0,0,0,0,0,0,0,0,0,0,0,0,0,0,0,0,0,0,{"$f":"Z136+Z148+Z154+Z161","v":0},0,0,0,0,0,0,0,0,0,0,0,0,0,0,0,0,0,0,0,0,0,0,0,0,0,0,0,0,0,0,0,0,0,0,0,0,0,0,0,0,0,0,0,0,0,0,0,0,0,0,0,0,0,0]
["Achats et charges externes",null,null,null,null,{"$f":"+F137+F138+F142+F143+F146","v":0},0,0,0,0,0,0,0,0,0,0,0,0,0,0,0,0,0,0,0,{"$f":"+Z137+Z138+Z142+Z143+Z146","v":0},0,0,0,0,0,0,0,0,0,0,0,0,0,0,0,0,0,0,0,0,0,0,0,0,0,0,0,0,0,0,0,0,0,0,0,0,0,0,0,0,0,0,0,0,0,0,0,0,0,0,0,0,0,0]
["Energie, achats stockés et consommables","Dépenses liées au carburant, électricité, eau, sel et pièces détachées"]
["Gros entretien sur infrastructures",null,null,null,null,null,{"$f":"SUM(G139:G141)","v":0},null,{"$f":"SUM(I139:I141)","v":0}]
["dont gros entretien sur chaussées ","Charge comptabilisée (OPEX)"]
["dont gros entretien sur ouvrages d'art","Charge comptabilisée (OPEX)"]
["dont autre gros entretien"]
["Entretien courant","Entretien matériel péage, réparations accidents et autre entretien"]
["Redevance domaniale",null,null,null,null,{"$f":"+SUM(F144:F145)","v":0},0,0,0,0,0,0,0,0,{"$f":"+SUM(O144:O145)","v":0},{"$f":"+SUM(P144:P145)","v":0},0,0,0,0,0,0,0,0,0,{"$f":"+SUM(Z144:Z145)","v":0},0,0,0,0,0,0,0,0,0,0,0,0,0,0,0,0,0,0,0,0,0,0,0,0,0,0,0,0,0,0,0,0,0,0,0,0,0,0,0,0,0,0,0,0,0,0,0,0,0,0,0,0,0,0]
["Charge redevance domaniale brute comptabilisée","Montant brut calculé (vision comptable)"]
["Remboursement reçu de l'Etat au titre de la redevance domaniale ","Montant remboursé par l'Etat suite négociations. \nSeules les nouvelles SCA sont concernées. \nAttention, il s'agit d'un produit ! Doit apparaître avec un signe '+'"]
["Autres prestations et charges externes"]
["dont contrat d'exploitation","Concerne uniquement les SCA pour lesquelles l'exploitation fait l'objet d'un contrat spécifique auprès d'un prestataire externe"]
["Charges de personnel (yc participation et CICE)",null,null,null,null,null,{"$f":"SUM(G149:G153)","v":0},null,{"$f":"SUM(I149:I153)","v":0}]
["Salaires et traitements","Inscrire uniquement la masse salariale liée aux effectifs propres de la SCA. \nSi la SCA n'a aucun effectif, incrire 0."]
["Charges sociales et engagements sociaux différés","Ne sont à prendre en compte que les provisions pour engagements sociaux différés non exceptionnels (IFC, CATS, congés payés, CET…) hors plan de départ"]
["Intéressement, abondement du plan d'épargne et participation","La participation est réintégrée dans cette ligne "]
["CICE","S'agissant d'un produit, le montant doit apparaître en positif"]
["Autres charges de personnel","Préciser les autres postes significatifs (comme par ex. la formation, l'habillage et la visite médicale)"]
["Impôts et taxes",null,null,null,null,{"$f":"+F155+F158+F159+F160","v":0},0,0,0,0,0,0,0,0,0,0,0,0,0,0,0,0,0,0,0,{"$f":"+Z155+Z158+Z159+Z160","v":0},0,0,0,0,0,0,0,0,0,0,0,0,0,0,0,0,0,0,0,0,0,0,0,0,0,0,0,0,0,0,0,0,0,0,0,0,0,0,0,0,0,0,0,0,0,0,0,0,0,0,0,0,0,0]
["TAT",null,null,null,null,{"$f":"SUM(F156:F157)","v":0},0,0,0,0,0,0,0,0,0,0,0,0,0,0,0,0,0,0,0,{"$f":"SUM(Z156:Z157)","v":0},0,0,0,0,0,0,0,0,0,0,0,0,0,0,0,0,0,0,0,0,0,0,0,0,0,0,0,0,0,0,0,0,0,0,0,0,0,0,0,0,0,0,0,0,0,0,0,0,0,0,0,0,0,0]
["Charge TAT brute comptabilisée","Montant brut calculé et payé"]
["Remboursement reçu de l'Etat au titre de la TAT","Montant remboursé par l'Etat suite négociations. \nSeules les nouvelles SCA sont concernées. \nAttention, il s'agit d'un produit ! Doit apparaître avec un signe '+'"]
["CET"]
["CVE"]
["Autres impôts et taxes","Hors redevance domaniale"]
["Autres charges d'exploitation","Montants correspondant aux comptes 65 du PCG.\nNe pas netter avec les autres produits d'exploitation de la ligne 51"]
["EBITDA","Notion non définie dans les French Gaap correspondant au solde entre CA + Autres revenus d'exploitation et les charges d'exploitaion (hors dotations aux amortissements et provisions).\nA la différence de l'EBE, l'EBITDA prend en compte la participation des salariés et les autres charges d'exploitation",null,null,null,{"$f":"F118+F130+F135","v":0},0,0,0,0,0,0,0,0,0,0,0,0,0,0,0,0,0,0,0,{"$f":"Z118+Z130+Z135","v":0},0,0,0,0,0,0,0,0,0,0,0,0,0,0,0,0,0,0,0,0,0,0,0,0,0,0,0,0,0,0,0,0,0,0,0,0,0,0,0,0,0,0,0,0,0,0,0,0,0,0,0,0,0,0]
["marge Ebitda",null,null,null,null,{"$f":"IFERROR(F162/F118,\"\")","v":""},"","","","","","","","","","","","","","","","","","","",{"$f":"IFERROR(Z162/Z118,\"\")","v":""},"","","","","","","","","","","","","","","","","","","","","","","","","","","","","","","","","","","","","","","","","","","","","","","","","","","","","",""]
["Dotations aux amortissements",null,null,null,null,{"$f":"+F165+F166","v":0},{"$f":"+G165+G166","v":0},{"$f":"+H165+H166","v":0},0,0,0,0,0,0,0,0,0,0,0,0,0,0,0,0,0,{"$f":"+Z165+Z166","v":0},0,0,0,0,0,0,0,0,0,0,0,0,0,0,0,0,0,0,0,0,0,0,0,0,0,0,0,0,0,0,0,0,0,0,0,0,0,0,0,0,0,0,0,0,0,0,0,0,0,0,0,0,0,0]
["Dotations aux amortissements des immobilisations non renouvelables","Correspond à l'amortissement de caducité"]
["Dotations aux amortissements des immobilisations renouvelables","Correspond à l'amortissement technique des immobilisations d'exploitation et à l'amortissement des immobilisation incorporelles"]
["Autres dotations aux amort. et prov. (net reprises)",null,null,null,null,null,{"$f":"SUM(G168:G171)","v":0},null,{"$f":"SUM(I168:I171)","v":0}]
["dont provision / reprise pour renouvellement des couches de chaussées","si reprise, montant positif '+' car produit"]
["dont provision / reprise pour maintien en état des ouvrages d'art","si reprise, montant positif '+' car produit"]
["dont provision / reprise exceptionnelle liée à la masse salariale","si reprise, montant positif '+' car produit"]
["dont autres provisions / reprises d'exploitation","si reprise, montant positif '+' car produit"]
["Reprises des subventions d'investissement","Attention, il s'agit d'un produit ! Doit apparaître avec un signe '+'"]
["EBIT",null,null,null,null,{"$f":"F162+F164+F167+F172","v":0},0,0,0,0,{"$f":"K162+K164+K167+K172","v":0},{"$f":"L162+L164+L167+L172","v":0},0,0,0,0,0,0,0,0,0,0,0,0,0,{"$f":"Z162+Z164+Z167+Z172","v":0},0,0,0,0,0,0,0,0,0,0,0,0,0,0,0,0,0,0,0,0,0,0,0,0,0,0,0,0,0,0,0,0,0,0,0,0,0,0,0,0,0,0,0,0,0,0,0,0,0,0,0,0,0,0]
[]
[]
["Compte de résultat concession 2"]
[]
["( en M€ courants )  ","Aide à la saisie","Commentaires SCA","Ref liasse Fiscale quand applicable - Formulaire Cerfa n°2052 et 2053 ","Checks","2015 (p)","2015 (r)","2016 (p)","2016 (r)","2017 (p)","2018 (p)","2019 (p)","2020 (p)","2021 (p)","2022 (p)","2023 (p)","2024 (p)","2025 (p)","2026 (p)","2027 (p)","2028 (p)","2029 (p)","2030 (p)","2031 (p)","2032 (p)","2033 (p)","2034 (p)","2035 (p)","2036 (p)","2037 (p)","2038 (p)","2039 (p)","2040 (p)","2041 (p)","2042 (p)","2043 (p)","2044 (p)","2045 (p)","2046 (p)","2047 (p)","2048 (p)","2049 (p)","2050 (p)","2051 (p)","2052 (p)","2053 (p)","2054 (p)","2055 (p)","2056 (p)","2057 (p)","2058 (p)","2059 (p)","2060 (p)","2061 (p)","2062 (p)","2063 (p)","2064 (p)","2065 (p)","2066 (p)","2067 (p)","2068 (p)","2069 (p)","2070 (p)","2071 (p)","2072 (p)","2073 (p)","2074 (p)","2075 (p)","2076 (p)","2077 (p)","2078 (p)","2079 (p)","2080 (p)","2081 (p)","2082 (p)","2083 (p)","2084 (p)","2085 (p)","2086 (p)","2087 (p)"]
["CHIFFRES D'AFFAIRES",null,null,null,null,{"$f":"+F180+F187","v":0},0,0,0,0,0,0,0,0,0,0,0,0,0,0,0,0,0,0,0,{"$f":"+Z180+Z187","v":0},0,0,0,0,0,0,0,0,0,0,0,0,0,0,0,0,0,0,0,0,0,0,0,0,0,0,0,0,0,0,0,0,0,0,0,0,0,0,0,0,0,0,0,0,0,0,0,0,0,0,0,0,0,0]
["Chiffre d'Affaires péage","CA péage net",null,null,null,{"$f":"SUM(F181:F182)","v":0},{"$f":"SUM(G181:G182)","v":0},{"$f":"SUM(H181:H182)","v":0},0,0,0,0,0,0,0,0,0,0,0,0,0,0,0,0,0,{"$f":"SUM(Z181:Z182)","v":0},0,0,0,0,0,0,0,0,0,0,0,0,0,0,0,0,0,0,0,0,0,0,0,0,0,0,0,0,0,0,0,0,0,0,0,0,0,0,0,0,0,0,0,0,0,0,0,0,0,0,0,0,0,0]
["CA Péage VL",null,"w"]
["CA Péage PL",null,"w"]
["% Evolution",null,"w",null,null,null,null,{"$f":"IFERROR(H180/F180-1,\"\")","v":""},{"$f":"IFERROR(I180/G180-1,\"\")","v":""},{"$f":"IFERROR(J180/I180-1,\"\")","v":""},{"$f":"IFERROR(K180/J180-1,\"\")","v":""},{"$f":"IFERROR(L180/K180-1,\"\")","v":""},{"$f":"IFERROR(M180/L180-1,\"\")","v":""},{"$f":"IFERROR(N180/M180-1,\"\")","v":""},{"$f":"IFERROR(O180/N180-1,\"\")","v":""},{"$f":"IFERROR(P180/O180-1,\"\")","v":""},{"$f":"IFERROR(Q180/P180-1,\"\")","v":""},{"$f":"IFERROR(R180/Q180-1,\"\")","v":""},{"$f":"IFERROR(S180/R180-1,\"\")","v":""},{"$f":"IFERROR(T180/S180-1,\"\")","v":""},{"$f":"IFERROR(U180/T180-1,\"\")","v":""},{"$f":"IFERROR(V180/U180-1,\"\")","v":""},{"$f":"IFERROR(W180/V180-1,\"\")","v":""},{"$f":"IFERROR(X180/W180-1,\"\")","v":""},{"$f":"IFERROR(Y180/X180-1,\"\")","v":""},{"$f":"IFERROR(Z180/Y180-1,\"\")","v":""},{"$f":"IFERROR(AA180/Z180-1,\"\")","v":""},{"$f":"IFERROR(AB180/AA180-1,\"\")","v":""},{"$f":"IFERROR(AC180/AB180-1,\"\")","v":""},{"$f":"IFERROR(AD180/AC180-1,\"\")","v":""},{"$f":"IFERROR(AE180/AD180-1,\"\")","v":""},{"$f":"IFERROR(AF180/AE180-1,\"\")","v":""},{"$f":"IFERROR(AG180/AF180-1,\"\")","v":""},{"$f":"IFERROR(AH180/AG180-1,\"\")","v":""},{"$f":"IFERROR(AI180/AH180-1,\"\")","v":""},{"$f":"IFERROR(AJ180/AI180-1,\"\")","v":""},{"$f":"IFERROR(AK180/AJ180-1,\"\")","v":""},{"$f":"IFERROR(AL180/AK180-1,\"\")","v":""},{"$f":"IFERROR(AM180/AL180-1,\"\")","v":""},{"$f":"IFERROR(AN180/AM180-1,\"\")","v":""},{"$f":"IFERROR(AO180/AN180-1,\"\")","v":""},{"$f":"IFERROR(AP180/AO180-1,\"\")","v":""},{"$f":"IFERROR(AQ180/AP180-1,\"\")","v":""},{"$f":"IFERROR(AR180/AQ180-1,\"\")","v":""},{"$f":"IFERROR(AS180/AR180-1,\"\")","v":""},{"$f":"IFERROR(AT180/AS180-1,\"\")","v":""},{"$f":"IFERROR(AU180/AT180-1,\"\")","v":""},{"$f":"IFERROR(AV180/AU180-1,\"\")","v":""},{"$f":"IFERROR(AW180/AV180-1,\"\")","v":""},{"$f":"IFERROR(AX180/AW180-1,\"\")","v":""},{"$f":"IFERROR(AY180/AX180-1,\"\")","v":""},{"$f":"IFERROR(AZ180/AY180-1,\"\")","v":""},{"$f":"IFERROR(BA180/AZ180-1,\"\")","v":""},{"$f":"IFERROR(BB180/BA180-1,\"\")","v":""},{"$f":"IFERROR(BC180/BB180-1,\"\")","v":""},{"$f":"IFERROR(BD180/BC180-1,\"\")","v":""},{"$f":"IFERROR(BE180/BD180-1,\"\")","v":""},{"$f":"IFERROR(BF180/BE180-1,\"\")","v":""},{"$f":"IFERROR(BG180/BF180-1,\"\")","v":""},{"$f":"IFERROR(BH180/BG180-1,\"\")","v":""},{"$f":"IFERROR(BI180/BH180-1,\"\")","v":""},{"$f":"IFERROR(BJ180/BI180-1,\"\")","v":""},{"$f":"IFERROR(BK180/BJ180-1,\"\")","v":""},{"$f":"IFERROR(BL180/BK180-1,\"\")","v":""},{"$f":"IFERROR(BM180/BL180-1,\"\")","v":""},{"$f":"IFERROR(BN180/BM180-1,\"\")","v":""},{"$f":"IFERROR(BO180/BN180-1,\"\")","v":""},{"$f":"IFERROR(BP180/BO180-1,\"\")","v":""},{"$f":"IFERROR(BQ180/BP180-1,\"\")","v":""},{"$f":"IFERROR(BR180/BQ180-1,\"\")","v":""},{"$f":"IFERROR(BS180/BR180-1,\"\")","v":""},{"$f":"IFERROR(BT180/BS180-1,\"\")","v":""},{"$f":"IFERROR(BU180/BT180-1,\"\")","v":""},{"$f":"IFERROR(BV180/BU180-1,\"\")","v":""},{"$f":"IFERROR(BW180/BV180-1,\"\")","v":""},{"$f":"IFERROR(BX180/BW180-1,\"\")","v":""},{"$f":"IFERROR(BY180/BX180-1,\"\")","v":""},{"$f":"IFERROR(BZ180/BY180-1,\"\")","v":""},{"$f":"IFERROR(CA180/BZ180-1,\"\")","v":""},{"$f":"IFERROR(CB180/CA180-1,\"\")","v":""}]
["dont CA net VL",null,"w",null,null,null,null,"","","","","","","","","","","","","","","","","","","","","","","","","","","","","","","","","","","","","","","","","","","","","","","","","","","","","","","","","","","","","","","","","","","","","","","","",""]
["dont CA net PL",null,"w",null,null,null,null,"","","","","","","","","","","","","","","","","","","","","","","","","","","","","","","","","","","","","","","","","","","","","","","","","","","","","","","","","","","","","","","","","","","","","","","","",""]
["Check Evolution du CA péage","Vérification que le CA péage correspond bien à la somme du CA péage par classe.\nSi le check est rouge, revoir le détail du CA péage.",null,null,{"$f":"'9. Checks (ARAFER)'!E13","v":"OK"}]
["Revenus des activités annexes",null,null,null,null,{"$f":"SUM(F188:F190)","v":0},0,0,0,0,0,0,0,0,0,0,0,0,0,0,0,0,0,0,0,{"$f":"SUM(Z188:Z190)","v":0},0,0,0,0,0,0,0,0,0,0,0,0,0,0,0,0,0,0,0,0,0,0,0,0,0,0,0,0,0,0,0,0,0,0,0,0,0,0,0,0,0,0,0,0,0,0,0,0,0,0,0,0,0,0]
[" Redevances des installations commerciales",null,"w"]
[" Redevances des installations de télécommunication","Locations de fibres optiques et pylones aux opérateurs télécoms","w"]
[" Autres éléments du chiffre d'affaires","Exemple : Vente dépannage carburant, commissions TIS VL, prestations d'ingénierie, prestations d'exploitation et de sécurité pour tiers  (collectivités locales, autre SCA), frais de gestion des badges liber-t, mise à disposition de personel pour tiers. \nDétails à  préciser en commentaires.","w"]
["AUTRES REVENUS D'EXPLOITATION",null,null,null,null,null,{"$f":"SUM(G192:G195)","v":0},null,{"$f":"SUM(I192:I195)","v":0}]
["Production immobilisée",null,"w"]
["Remboursement accidents",null,"w"]
["Subventions d'exploitation",null,"w"]
["Autres produits d'exploitation","Montants correspondant aux comptes 72/74 et 75 du PCG.\nDétailler le contenu en commentaires.\nNe pas netter avec les autres charges d'exploitation","w"]
["CHARGES D'EXPLOITATION",null,null,null,null,{"$f":"F197+F209+F215+F222","v":0},0,0,0,0,0,0,0,0,0,0,0,0,0,0,0,0,0,0,0,{"$f":"Z197+Z209+Z215+Z222","v":0},0,0,0,0,0,0,0,0,0,0,0,0,0,0,0,0,0,0,0,0,0,0,0,0,0,0,0,0,0,0,0,0,0,0,0,0,0,0,0,0,0,0,0,0,0,0,0,0,0,0,0,0,0,0]
["Achats et charges externes",null,null,null,null,{"$f":"+F198+F199+F203+F204+F207","v":0},0,0,0,0,0,0,0,0,0,0,0,0,0,0,0,0,0,0,0,{"$f":"+Z198+Z199+Z203+Z204+Z207","v":0},0,0,0,0,0,0,0,0,0,0,0,0,0,0,0,0,0,0,0,0,0,0,0,0,0,0,0,0,0,0,0,0,0,0,0,0,0,0,0,0,0,0,0,0,0,0,0,0,0,0,0,0,0,0]
["Energie, achats stockés et consommables","Dépenses liées au carburant, électricité, eau, sel et pièces détachées","w"]
["Gros entretien sur infrastructures",null,"w",null,null,null,{"$f":"SUM(G200:G202)","v":0},null,{"$f":"SUM(I200:I202)","v":0}]
["dont gros entretien sur chaussées ","Charge comptabilisée (OPEX)","w"]
["dont gros entretien sur ouvrages d'art","Charge comptabilisée (OPEX)","w"]
["dont autre gros entretien",null,"w"]
["Entretien courant","Entretien matériel péage, réparations accidents et autre entretien","w"]
["Redevance domaniale",null,"w",null,null,{"$f":"+SUM(F205:F206)","v":0},0,0,0,0,0,0,0,0,{"$f":"+SUM(O205:O206)","v":0},{"$f":"+SUM(P205:P206)","v":0},0,0,0,0,0,0,0,0,0,{"$f":"+SUM(Z205:Z206)","v":0},0,0,0,0,0,0,0,0,0,0,0,0,0,0,0,0,0,0,0,0,0,0,0,0,0,0,0,0,0,0,0,0,0,0,0,0,0,0,0,0,0,0,0,0,0,0,0,0,0,0,0,0,0,0]
["Charge redevance domaniale brute comptabilisée","Montant brut calculé (vision comptable)","w"]
["Remboursement reçu de l'Etat au titre de la redevance domaniale ","Montant remboursé par l'Etat suite négociations. \nSeules les nouvelles SCA sont concernées. \nAttention, il s'agit d'un produit ! Doit apparaître avec un signe '+'","w"]
["Autres prestations et charges externes",null,"w"]
["dont contrat d'exploitation","Concerne uniquement les SCA pour lesquelles l'exploitation fait l'objet d'un contrat spécifique auprès d'un prestataire externe","w"]
["Charges de personnel (yc participation et CICE)",null,null,null,null,null,{"$f":"SUM(G210:G214)","v":0},null,{"$f":"SUM(I210:I214)","v":0}]
["Salaires et traitements","Inscrire uniquement la masse salariale liée aux effectifs propres de la SCA. \nSi la SCA n'a aucun effectif, incrire 0.","w"]
["Charges sociales et engagements sociaux différés","Ne sont à prendre en compte que les provisions pour engagements sociaux différés non exceptionnels (IFC, CATS, congés payés, CET…) hors plan de départ","w"]
["Intéressement, abondement du plan d'épargne et participation","La participation est réintégrée dans cette ligne ","w"]
["CICE","S'agissant d'un produit, le montant doit apparaître en positif","w"]
["Autres charges de personnel","Préciser les autres postes significatifs (comme par ex. la formation, l'habillage et la visite médicale)","w"]
["Impôts et taxes",null,null,null,null,{"$f":"+F216+F219+F220+F221","v":0},0,0,0,0,0,0,0,0,0,0,0,0,0,0,0,0,0,0,0,{"$f":"+Z216+Z219+Z220+Z221","v":0},0,0,0,0,0,0,0,0,0,0,0,0,0,0,0,0,0,0,0,0,0,0,0,0,0,0,0,0,0,0,0,0,0,0,0,0,0,0,0,0,0,0,0,0,0,0,0,0,0,0,0,0,0,0]
["TAT",null,"w",null,null,{"$f":"SUM(F217:F218)","v":0},0,0,0,0,0,0,0,0,0,0,0,0,0,0,0,0,0,0,0,{"$f":"SUM(Z217:Z218)","v":0},0,0,0,0,0,0,0,0,0,0,0,0,0,0,0,0,0,0,0,0,0,0,0,0,0,0,0,0,0,0,0,0,0,0,0,0,0,0,0,0,0,0,0,0,0,0,0,0,0,0,0,0,0,0]
["Charge TAT brute comptabilisée","Montant brut calculé et payé","w"]
["Remboursement reçu de l'Etat au titre de la TAT","Montant remboursé par l'Etat suite négociations. \nSeules les nouvelles SCA sont concernées. \nAttention, il s'agit d'un produit ! Doit apparaître avec un signe '+'","w"]
["CET",null,"w"]
["CVE",null,"w"]
["Autres impôts et taxes","Hors redevance domaniale","w"]
["Autres charges d'exploitation","Montants correspondant aux comptes 65 du PCG.\nNe pas netter avec les autres produits d'exploitation de la ligne 51","w"]
["EBITDA","Notion non définie dans les French Gaap correspondant au solde entre CA + Autres revenus d'exploitation et les charges d'exploitaion (hors dotations aux amortissements et provisions).\nA la différence de l'EBE, l'EBITDA prend en compte la participation des salariés et les autres charges d'exploitation",null,null,null,{"$f":"F179+F191+F196","v":0},0,0,0,0,0,0,0,0,0,0,0,0,0,0,0,0,0,0,0,{"$f":"Z179+Z191+Z196","v":0},0,0,0,0,0,0,0,0,0,0,0,0,0,0,0,0,0,0,0,0,0,0,0,0,0,0,0,0,0,0,0,0,0,0,0,0,0,0,0,0,0,0,0,0,0,0,0,0,0,0,0,0,0,0]
["marge Ebitda",null,null,null,null,{"$f":"IFERROR(F223/F179,\"\")","v":""},"","","","","","","","","","","","","","","","","","","",{"$f":"IFERROR(Z223/Z179,\"\")","v":""},"","","","","","","","","","","","","","","","","","","","","","","","","","","","","","","","","","","","","","","","","","","","","","","","","","","","","",""]
["Dotations aux amortissements",null,"w",null,null,{"$f":"+F226+F227","v":0},{"$f":"+G226+G227","v":0},{"$f":"+H226+H227","v":0},0,0,0,0,0,0,0,0,0,0,0,0,0,0,0,0,0,{"$f":"+Z226+Z227","v":0},0,0,0,0,0,0,0,0,0,0,0,0,0,0,0,0,0,0,0,0,0,0,0,0,0,0,0,0,0,0,0,0,0,0,0,0,0,0,0,0,0,0,0,0,0,0,0,0,0,0,0,0,0,0]
["Dotations aux amortissements des immobilisations non renouvelables","Correspond à l'amortissement de caducité","w"]
["Dotations aux amortissements des immobilisations renouvelables","Correspond à l'amortissement technique des immobilisations d'exploitation et à l'amortissement des immobilisation incorporelles","w"]
["Autres dotations aux amort. et prov. (net reprises)",null,"w",null,null,null,{"$f":"SUM(G229:G232)","v":0},null,{"$f":"SUM(I229:I232)","v":0}]
["dont provision / reprise pour renouvellement des couches de chaussées","si reprise, montant positif '+' car produit","w"]
["dont provision / reprise pour maintien en état des ouvrages d'art","si reprise, montant positif '+' car produit","w"]
["dont provision / reprise exceptionnelle liée à la masse salariale","si reprise, montant positif '+' car produit","w"]
["dont autres provisions / reprises d'exploitation","si reprise, montant positif '+' car produit","w"]
["Reprises des subventions d'investissement","Attention, il s'agit d'un produit ! Doit apparaître avec un signe '+'","w"]
["EBIT",null,null,null,null,{"$f":"F223+F225+F228+F233","v":0},0,0,0,0,{"$f":"K223+K225+K228+K233","v":0},{"$f":"L223+L225+L228+L233","v":0},0,0,0,0,0,0,0,0,0,0,0,0,0,{"$f":"Z223+Z225+Z228+Z233","v":0},0,0,0,0,0,0,0,0,0,0,0,0,0,0,0,0,0,0,0,0,0,0,0,0,0,0,0,0,0,0,0,0,0,0,0,0,0,0,0,0,0,0,0,0,0,0,0,0,0,0,0,0,0,0]

{"sheet":"3. CF","index":3,"n_rows":42,"n_cols":80,"rows_kept":42,"cut":false,"hidden":false,"merged":[[1,0,1,27],[22,1,23,1]]}
[{"$f":"'1. Info'!$D$5","v":0},null,null,null,null,null,null,null,null,null,null,null,null,null,null,null,null,null,null,null,null,null,null,null,null,null,null,"Date"]
["Plan de trésorerie"]
[]
["( en M€ courants  )  ","Aide à la saisie","Commentaires SCA",null,"Checks","2015 (p)","2015 (r)","2016 (p)","2016 (r)","2017 (p)","2018 (p)","2019 (p)","2020 (p)","2021 (p)","2022 (p)","2023 (p)","2024 (p)","2025 (p)","2026 (p)","2027 (p)","2028 (p)","2029 (p)","2030 (p)","2031 (p)","2032 (p)","2033 (p)","2034 (p)","2035 (p)","2036 (p)","2037 (p)","2038 (p)","2039 (p)","2040 (p)","2041 (p)","2042 (p)","2043 (p)","2044 (p)","2045 (p)","2046 (p)","2047 (p)","2048 (p)","2049 (p)","2050 (p)","2051 (p)","2052 (p)","2053 (p)","2054 (p)","2055 (p)","2056 (p)","2057 (p)","2058 (p)","2059 (p)","2060 (p)","2061 (p)","2062 (p)","2063 (p)","2064 (p)","2065 (p)","2066 (p)","2067 (p)","2068 (p)","2069 (p)","2070 (p)","2071 (p)","2072 (p)","2073 (p)","2074 (p)","2075 (p)","2076 (p)","2077 (p)","2078 (p)","2079 (p)","2080 (p)","2081 (p)","2082 (p)","2083 (p)","2084 (p)","2085 (p)","2086 (p)","2087 (p)"]
["EBIT","Donnée en liaison avec le P&L",null,null,null,{"$f":"'2. P&L'!F87","v":0},{"$f":"'2. P&L'!G87","v":0},{"$f":"'2. P&L'!H87","v":0},{"$f":"'2. P&L'!I87","v":0},{"$f":"'2. P&L'!J87","v":0},{"$f":"'2. P&L'!K87","v":0},{"$f":"'2. P&L'!L87","v":0},{"$f":"'2. P&L'!M87","v":0},{"$f":"'2. P&L'!N87","v":0},{"$f":"'2. P&L'!O87","v":0},{"$f":"'2. P&L'!P87","v":0},{"$f":"'2. P&L'!Q87","v":0},{"$f":"'2. P&L'!R87","v":0},{"$f":"'2. P&L'!S87","v":0},{"$f":"'2. P&L'!T87","v":0},{"$f":"'2. P&L'!U87","v":0},{"$f":"'2. P&L'!V87","v":0},{"$f":"'2. P&L'!W87","v":0},{"$f":"'2. P&L'!X87","v":0},{"$f":"'2. P&L'!Y87","v":0},{"$f":"'2. P&L'!Z87","v":0},{"$f":"'2. P&L'!AA87","v":0},{"$f":"'2. P&L'!AB87","v":0},{"$f":"'2. P&L'!AC87","v":0},{"$f":"'2. P&L'!AD87","v":0},{"$f":"'2. P&L'!AE87","v":0},{"$f":"'2. P&L'!AF87","v":0},{"$f":"'2. P&L'!AG87","v":0},{"$f":"'2. P&L'!AH87","v":0},{"$f":"'2. P&L'!AI87","v":0},{"$f":"'2. P&L'!AJ87","v":0},{"$f":"'2. P&L'!AK87","v":0},{"$f":"'2. P&L'!AL87","v":0},{"$f":"'2. P&L'!AM87","v":0},{"$f":"'2. P&L'!AN87","v":0},{"$f":"'2. P&L'!AO87","v":0},{"$f":"'2. P&L'!AP87","v":0},{"$f":"'2. P&L'!AQ87","v":0},{"$f":"'2. P&L'!AR87","v":0},{"$f":"'2. P&L'!AS87","v":0},{"$f":"'2. P&L'!AT87","v":0},{"$f":"'2. P&L'!AU87","v":0},{"$f":"'2. P&L'!AV87","v":0},{"$f":"'2. P&L'!AW87","v":0},{"$f":"'2. P&L'!AX87","v":0},{"$f":"'2. P&L'!AY87","v":0},{"$f":"'2. P&L'!AZ87","v":0},{"$f":"'2. P&L'!BA87","v":0},{"$f":"'2. P&L'!BB87","v":0},{"$f":"'2. P&L'!BC87","v":0},{"$f":"'2. P&L'!BD87","v":0},{"$f":"'2. P&L'!BE87","v":0},{"$f":"'2. P&L'!BF87","v":0},{"$f":"'2. P&L'!BG87","v":0},{"$f":"'2. P&L'!BH87","v":0},{"$f":"'2. P&L'!BI87","v":0},{"$f":"'2. P&L'!BJ87","v":0},{"$f":"'2. P&L'!BK87","v":0},{"$f":"'2. P&L'!BL87","v":0},{"$f":"'2. P&L'!BM87","v":0},{"$f":"'2. P&L'!BN87","v":0},{"$f":"'2. P&L'!BO87","v":0},{"$f":"'2. P&L'!BP87","v":0},{"$f":"'2. P&L'!BQ87","v":0},{"$f":"'2. P&L'!BR87","v":0},{"$f":"'2. P&L'!BS87","v":0},{"$f":"'2. P&L'!BT87","v":0},{"$f":"'2. P&L'!BU87","v":0},{"$f":"'2. P&L'!BV87","v":0},{"$f":"'2. P&L'!BW87","v":0},{"$f":"'2. P&L'!BX87","v":0},{"$f":"'2. P&L'!BY87","v":0},{"$f":"'2. P&L'!BZ87","v":0},{"$f":"'2. P&L'!CA87","v":0},{"$f":"'2. P&L'!CB87","v":0}]
["Amortissements nets de subventions et provisions","Donnée en liaison avec le P&L",null,null,null,{"$f":"-'2. P&L'!F78-'2. P&L'!F81-'2. P&L'!F86","v":0},{"$f":"-'2. P&L'!G78-'2. P&L'!G81-'2. P&L'!G86","v":0},{"$f":"-'2. P&L'!H78-'2. P&L'!H81-'2. P&L'!H86","v":0},{"$f":"-'2. P&L'!I78-'2. P&L'!I81-'2. P&L'!I86","v":0},{"$f":"-'2. P&L'!J78-'2. P&L'!J81-'2. P&L'!J86","v":0},{"$f":"-'2. P&L'!K78-'2. P&L'!K81-'2. P&L'!K86","v":0},{"$f":"-'2. P&L'!L78-'2. P&L'!L81-'2. P&L'!L86","v":0},{"$f":"-'2. P&L'!M78-'2. P&L'!M81-'2. P&L'!M86","v":0},{"$f":"-'2. P&L'!N78-'2. P&L'!N81-'2. P&L'!N86","v":0},{"$f":"-'2. P&L'!O78-'2. P&L'!O81-'2. P&L'!O86","v":0},{"$f":"-'2. P&L'!P78-'2. P&L'!P81-'2. P&L'!P86","v":0},{"$f":"-'2. P&L'!Q78-'2. P&L'!Q81-'2. P&L'!Q86","v":0},{"$f":"-'2. P&L'!R78-'2. P&L'!R81-'2. P&L'!R86","v":0},{"$f":"-'2. P&L'!S78-'2. P&L'!S81-'2. P&L'!S86","v":0},{"$f":"-'2. P&L'!T78-'2. P&L'!T81-'2. P&L'!T86","v":0},{"$f":"-'2. P&L'!U78-'2. P&L'!U81-'2. P&L'!U86","v":0},{"$f":"-'2. P&L'!V78-'2. P&L'!V81-'2. P&L'!V86","v":0},{"$f":"-'2. P&L'!W78-'2. P&L'!W81-'2. P&L'!W86","v":0},{"$f":"-'2. P&L'!X78-'2. P&L'!X81-'2. P&L'!X86","v":0},{"$f":"-'2. P&L'!Y78-'2. P&L'!Y81-'2. P&L'!Y86","v":0},{"$f":"-'2. P&L'!Z78-'2. P&L'!Z81-'2. P&L'!Z86","v":0},{"$f":"-'2. P&L'!AA78-'2. P&L'!AA81-'2. P&L'!AA86","v":0},{"$f":"-'2. P&L'!AB78-'2. P&L'!AB81-'2. P&L'!AB86","v":0},{"$f":"-'2. P&L'!AC78-'2. P&L'!AC81-'2. P&L'!AC86","v":0},{"$f":"-'2. P&L'!AD78-'2. P&L'!AD81-'2. P&L'!AD86","v":0},{"$f":"-'2. P&L'!AE78-'2. P&L'!AE81-'2. P&L'!AE86","v":0},{"$f":"-'2. P&L'!AF78-'2. P&L'!AF81-'2. P&L'!AF86","v":0},{"$f":"-'2. P&L'!AG78-'2. P&L'!AG81-'2. P&L'!AG86","v":0},{"$f":"-'2. P&L'!AH78-'2. P&L'!AH81-'2. P&L'!AH86","v":0},{"$f":"-'2. P&L'!AI78-'2. P&L'!AI81-'2. P&L'!AI86","v":0},{"$f":"-'2. P&L'!AJ78-'2. P&L'!AJ81-'2. P&L'!AJ86","v":0},{"$f":"-'2. P&L'!AK78-'2. P&L'!AK81-'2. P&L'!AK86","v":0},{"$f":"-'2. P&L'!AL78-'2. P&L'!AL81-'2. P&L'!AL86","v":0},{"$f":"-'2. P&L'!AM78-'2. P&L'!AM81-'2. P&L'!AM86","v":0},{"$f":"-'2. P&L'!AN78-'2. P&L'!AN81-'2. P&L'!AN86","v":0},{"$f":"-'2. P&L'!AO78-'2. P&L'!AO81-'2. P&L'!AO86","v":0},{"$f":"-'2. P&L'!AP78-'2. P&L'!AP81-'2. P&L'!AP86","v":0},{"$f":"-'2. P&L'!AQ78-'2. P&L'!AQ81-'2. P&L'!AQ86","v":0},{"$f":"-'2. P&L'!AR78-'2. P&L'!AR81-'2. P&L'!AR86","v":0},{"$f":"-'2. P&L'!AS78-'2. P&L'!AS81-'2. P&L'!AS86","v":0},{"$f":"-'2. P&L'!AT78-'2. P&L'!AT81-'2. P&L'!AT86","v":0},{"$f":"-'2. P&L'!AU78-'2. P&L'!AU81-'2. P&L'!AU86","v":0},{"$f":"-'2. P&L'!AV78-'2. P&L'!AV81-'2. P&L'!AV86","v":0},{"$f":"-'2. P&L'!AW78-'2. P&L'!AW81-'2. P&L'!AW86","v":0},{"$f":"-'2. P&L'!AX78-'2. P&L'!AX81-'2. P&L'!AX86","v":0},{"$f":"-'2. P&L'!AY78-'2. P&L'!AY81-'2. P&L'!AY86","v":0},{"$f":"-'2. P&L'!AZ78-'2. P&L'!AZ81-'2. P&L'!AZ86","v":0},{"$f":"-'2. P&L'!BA78-'2. P&L'!BA81-'2. P&L'!BA86","v":0},{"$f":"-'2. P&L'!BB78-'2. P&L'!BB81-'2. P&L'!BB86","v":0},{"$f":"-'2. P&L'!BC78-'2. P&L'!BC81-'2. P&L'!BC86","v":0},{"$f":"-'2. P&L'!BD78-'2. P&L'!BD81-'2. P&L'!BD86","v":0},{"$f":"-'2. P&L'!BE78-'2. P&L'!BE81-'2. P&L'!BE86","v":0},{"$f":"-'2. P&L'!BF78-'2. P&L'!BF81-'2. P&L'!BF86","v":0},{"$f":"-'2. P&L'!BG78-'2. P&L'!BG81-'2. P&L'!BG86","v":0},{"$f":"-'2. P&L'!BH78-'2. P&L'!BH81-'2. P&L'!BH86","v":0},{"$f":"-'2. P&L'!BI78-'2. P&L'!BI81-'2. P&L'!BI86","v":0},{"$f":"-'2. P&L'!BJ78-'2. P&L'!BJ81-'2. P&L'!BJ86","v":0},{"$f":"-'2. P&L'!BK78-'2. P&L'!BK81-'2. P&L'!BK86","v":0},{"$f":"-'2. P&L'!BL78-'2. P&L'!BL81-'2. P&L'!BL86","v":0},{"$f":"-'2. P&L'!BM78-'2. P&L'!BM81-'2. P&L'!BM86","v":0},{"$f":"-'2. P&L'!BN78-'2. P&L'!BN81-'2. P&L'!BN86","v":0},{"$f":"-'2. P&L'!BO78-'2. P&L'!BO81-'2. P&L'!BO86","v":0},{"$f":"-'2. P&L'!BP78-'2. P&L'!BP81-'2. P&L'!BP86","v":0},{"$f":"-'2. P&L'!BQ78-'2. P&L'!BQ81-'2. P&L'!BQ86","v":0},{"$f":"-'2. P&L'!BR78-'2. P&L'!BR81-'2. P&L'!BR86","v":0},{"$f":"-'2. P&L'!BS78-'2. P&L'!BS81-'2. P&L'!BS86","v":0},{"$f":"-'2. P&L'!BT78-'2. P&L'!BT81-'2. P&L'!BT86","v":0},{"$f":"-'2. P&L'!BU78-'2. P&L'!BU81-'2. P&L'!BU86","v":0},{"$f":"-'2. P&L'!BV78-'2. P&L'!BV81-'2. P&L'!BV86","v":0},{"$f":"-'2. P&L'!BW78-'2. P&L'!BW81-'2. P&L'!BW86","v":0},{"$f":"-'2. P&L'!BX78-'2. P&L'!BX81-'2. P&L'!BX86","v":0},{"$f":"-'2. P&L'!BY78-'2. P&L'!BY81-'2. P&L'!BY86","v":0},{"$f":"-'2. P&L'!BZ78-'2. P&L'!BZ81-'2. P&L'!BZ86","v":0},{"$f":"-'2. P&L'!CA78-'2. P&L'!CA81-'2. P&L'!CA86","v":0},{"$f":"-'2. P&L'!CB78-'2. P&L'!CB81-'2. P&L'!CB86","v":0}]
["Plus-value / moins-value de cession"]
["Intérêts financiers nets payés","Montant de frais financiers décaissés au cours de l'exercice (Données réelles pour le réalisé, données issues du P&L pour le prévisionnel)",null,null,null,{"$f":"'2. P&L'!F96+'2. P&L'!F93","v":0},null,{"$f":"'2. P&L'!H96+'2. P&L'!H93","v":0},null,{"$f":"'2. P&L'!J96+'2. P&L'!J93","v":0},{"$f":"'2. P&L'!K96+'2. P&L'!K93","v":0},{"$f":"'2. P&L'!L96+'2. P&L'!L93","v":0},{"$f":"'2. P&L'!M96+'2. P&L'!M93","v":0},{"$f":"'2. P&L'!N96+'2. P&L'!N93","v":0},{"$f":"'2. P&L'!O96+'2. P&L'!O93","v":0},{"$f":"'2. P&L'!P96+'2. P&L'!P93","v":0},{"$f":"'2. P&L'!Q96+'2. P&L'!Q93","v":0},{"$f":"'2. P&L'!R96+'2. P&L'!R93","v":0},{"$f":"'2. P&L'!S96+'2. P&L'!S93","v":0},{"$f":"'2. P&L'!T96+'2. P&L'!T93","v":0},{"$f":"'2. P&L'!U96+'2. P&L'!U93","v":0},{"$f":"'2. P&L'!V96+'2. P&L'!V93","v":0},{"$f":"'2. P&L'!W96+'2. P&L'!W93","v":0},{"$f":"'2. P&L'!X96+'2. P&L'!X93","v":0},{"$f":"'2. P&L'!Y96+'2. P&L'!Y93","v":0},{"$f":"'2. P&L'!Z96+'2. P&L'!Z93","v":0},{"$f":"'2. P&L'!AA96+'2. P&L'!AA93","v":0},{"$f":"'2. P&L'!AB96+'2. P&L'!AB93","v":0},{"$f":"'2. P&L'!AC96+'2. P&L'!AC93","v":0},{"$f":"'2. P&L'!AD96+'2. P&L'!AD93","v":0},{"$f":"'2. P&L'!AE96+'2. P&L'!AE93","v":0},{"$f":"'2. P&L'!AF96+'2. P&L'!AF93","v":0},{"$f":"'2. P&L'!AG96+'2. P&L'!AG93","v":0},{"$f":"'2. P&L'!AH96+'2. P&L'!AH93","v":0},{"$f":"'2. P&L'!AI96+'2. P&L'!AI93","v":0},{"$f":"'2. P&L'!AJ96+'2. P&L'!AJ93","v":0},{"$f":"'2. P&L'!AK96+'2. P&L'!AK93","v":0},{"$f":"'2. P&L'!AL96+'2. P&L'!AL93","v":0},{"$f":"'2. P&L'!AM96+'2. P&L'!AM93","v":0},{"$f":"'2. P&L'!AN96+'2. P&L'!AN93","v":0},{"$f":"'2. P&L'!AO96+'2. P&L'!AO93","v":0},{"$f":"'2. P&L'!AP96+'2. P&L'!AP93","v":0},{"$f":"'2. P&L'!AQ96+'2. P&L'!AQ93","v":0},{"$f":"'2. P&L'!AR96+'2. P&L'!AR93","v":0},{"$f":"'2. P&L'!AS96+'2. P&L'!AS93","v":0},{"$f":"'2. P&L'!AT96+'2. P&L'!AT93","v":0},{"$f":"'2. P&L'!AU96+'2. P&L'!AU93","v":0},{"$f":"'2. P&L'!AV96+'2. P&L'!AV93","v":0},{"$f":"'2. P&L'!AW96+'2. P&L'!AW93","v":0},{"$f":"'2. P&L'!AX96+'2. P&L'!AX93","v":0},{"$f":"'2. P&L'!AY96+'2. P&L'!AY93","v":0},{"$f":"'2. P&L'!AZ96+'2. P&L'!AZ93","v":0},{"$f":"'2. P&L'!BA96+'2. P&L'!BA93","v":0},{"$f":"'2. P&L'!BB96+'2. P&L'!BB93","v":0},{"$f":"'2. P&L'!BC96+'2. P&L'!BC93","v":0},{"$f":"'2. P&L'!BD96+'2. P&L'!BD93","v":0},{"$f":"'2. P&L'!BE96+'2. P&L'!BE93","v":0},{"$f":"'2. P&L'!BF96+'2. P&L'!BF93","v":0},{"$f":"'2. P&L'!BG96+'2. P&L'!BG93","v":0},{"$f":"'2. P&L'!BH96+'2. P&L'!BH93","v":0},{"$f":"'2. P&L'!BI96+'2. P&L'!BI93","v":0},{"$f":"'2. P&L'!BJ96+'2. P&L'!BJ93","v":0},{"$f":"'2. P&L'!BK96+'2. P&L'!BK93","v":0},{"$f":"'2. P&L'!BL96+'2. P&L'!BL93","v":0},{"$f":"'2. P&L'!BM96+'2. P&L'!BM93","v":0},{"$f":"'2. P&L'!BN96+'2. P&L'!BN93","v":0},{"$f":"'2. P&L'!BO96+'2. P&L'!BO93","v":0},{"$f":"'2. P&L'!BP96+'2. P&L'!BP93","v":0},{"$f":"'2. P&L'!BQ96+'2. P&L'!BQ93","v":0},{"$f":"'2. P&L'!BR96+'2. P&L'!BR93","v":0},{"$f":"'2. P&L'!BS96+'2. P&L'!BS93","v":0},{"$f":"'2. P&L'!BT96+'2. P&L'!BT93","v":0},{"$f":"'2. P&L'!BU96+'2. P&L'!BU93","v":0},{"$f":"'2. P&L'!BV96+'2. P&L'!BV93","v":0},{"$f":"'2. P&L'!BW96+'2. P&L'!BW93","v":0},{"$f":"'2. P&L'!BX96+'2. P&L'!BX93","v":0},{"$f":"'2. P&L'!BY96+'2. P&L'!BY93","v":0},{"$f":"'2. P&L'!BZ96+'2. P&L'!BZ93","v":0},{"$f":"'2. P&L'!CA96+'2. P&L'!CA93","v":0},{"$f":"'2. P&L'!CB96+'2. P&L'!CB93","v":0}]
["Impôts payés","Montant d'IS décaissé au cours de l'exercice (Données réelles pour le réalisé, données issues du P&L pour le prévisionnel)",null,null,null,{"$f":"'2. P&L'!F107","v":0},null,{"$f":"'2. P&L'!H107","v":0},null,{"$f":"'2. P&L'!J107","v":0},{"$f":"'2. P&L'!K107","v":0},{"$f":"'2. P&L'!L107","v":0},{"$f":"'2. P&L'!M107","v":0},{"$f":"'2. P&L'!N107","v":0},{"$f":"'2. P&L'!O107","v":0},{"$f":"'2. P&L'!P107","v":0},{"$f":"'2. P&L'!Q107","v":0},{"$f":"'2. P&L'!R107","v":0},{"$f":"'2. P&L'!S107","v":0},{"$f":"'2. P&L'!T107","v":0},{"$f":"'2. P&L'!U107","v":0},{"$f":"'2. P&L'!V107","v":0},{"$f":"'2. P&L'!W107","v":0},{"$f":"'2. P&L'!X107","v":0},{"$f":"'2. P&L'!Y107","v":0},{"$f":"'2. P&L'!Z107","v":0},{"$f":"'2. P&L'!AA107","v":0},{"$f":"'2. P&L'!AB107","v":0},{"$f":"'2. P&L'!AC107","v":0},{"$f":"'2. P&L'!AD107","v":0},{"$f":"'2. P&L'!AE107","v":0},{"$f":"'2. P&L'!AF107","v":0},{"$f":"'2. P&L'!AG107","v":0},{"$f":"'2. P&L'!AH107","v":0},{"$f":"'2. P&L'!AI107","v":0},{"$f":"'2. P&L'!AJ107","v":0},{"$f":"'2. P&L'!AK107","v":0},{"$f":"'2. P&L'!AL107","v":0},{"$f":"'2. P&L'!AM107","v":0},{"$f":"'2. P&L'!AN107","v":0},{"$f":"'2. P&L'!AO107","v":0},{"$f":"'2. P&L'!AP107","v":0},{"$f":"'2. P&L'!AQ107","v":0},{"$f":"'2. P&L'!AR107","v":0},{"$f":"'2. P&L'!AS107","v":0},{"$f":"'2. P&L'!AT107","v":0},{"$f":"'2. P&L'!AU107","v":0},{"$f":"'2. P&L'!AV107","v":0},{"$f":"'2. P&L'!AW107","v":0},{"$f":"'2. P&L'!AX107","v":0},{"$f":"'2. P&L'!AY107","v":0},{"$f":"'2. P&L'!AZ107","v":0},{"$f":"'2. P&L'!BA107","v":0},{"$f":"'2. P&L'!BB107","v":0},{"$f":"'2. P&L'!BC107","v":0},{"$f":"'2. P&L'!BD107","v":0},{"$f":"'2. P&L'!BE107","v":0},{"$f":"'2. P&L'!BF107","v":0},{"$f":"'2. P&L'!BG107","v":0},{"$f":"'2. P&L'!BH107","v":0},{"$f":"'2. P&L'!BI107","v":0},{"$f":"'2. P&L'!BJ107","v":0},{"$f":"'2. P&L'!BK107","v":0},{"$f":"'2. P&L'!BL107","v":0},{"$f":"'2. P&L'!BM107","v":0},{"$f":"'2. P&L'!BN107","v":0},{"$f":"'2. P&L'!BO107","v":0},{"$f":"'2. P&L'!BP107","v":0},{"$f":"'2. P&L'!BQ107","v":0},{"$f":"'2. P&L'!BR107","v":0},{"$f":"'2. P&L'!BS107","v":0},{"$f":"'2. P&L'!BT107","v":0},{"$f":"'2. P&L'!BU107","v":0},{"$f":"'2. P&L'!BV107","v":0},{"$f":"'2. P&L'!BW107","v":0},{"$f":"'2. P&L'!BX107","v":0},{"$f":"'2. P&L'!BY107","v":0},{"$f":"'2. P&L'!BZ107","v":0},{"$f":"'2. P&L'!CA107","v":0},{"$f":"'2. P&L'!CB107","v":0}]
["Revenus des titres de participation","Dividendes provenant de filiales ou intérêts portant sur des créances accordées à des filiales",null,null,null,{"$f":"'2. P&L'!F90","v":0},null,{"$f":"'2. P&L'!H90","v":0},null,{"$f":"'2. P&L'!J90","v":0},{"$f":"'2. P&L'!K90","v":0},{"$f":"'2. P&L'!L90","v":0},{"$f":"'2. P&L'!M90","v":0},{"$f":"'2. P&L'!N90","v":0},{"$f":"'2. P&L'!O90","v":0},{"$f":"'2. P&L'!P90","v":0},{"$f":"'2. P&L'!Q90","v":0},{"$f":"'2. P&L'!R90","v":0},{"$f":"'2. P&L'!S90","v":0},{"$f":"'2. P&L'!T90","v":0},{"$f":"'2. P&L'!U90","v":0},{"$f":"'2. P&L'!V90","v":0},{"$f":"'2. P&L'!W90","v":0},{"$f":"'2. P&L'!X90","v":0},{"$f":"'2. P&L'!Y90","v":0},{"$f":"'2. P&L'!Z90","v":0},{"$f":"'2. P&L'!AA90","v":0},{"$f":"'2. P&L'!AB90","v":0},{"$f":"'2. P&L'!AC90","v":0},{"$f":"'2. P&L'!AD90","v":0},{"$f":"'2. P&L'!AE90","v":0},{"$f":"'2. P&L'!AF90","v":0},{"$f":"'2. P&L'!AG90","v":0},{"$f":"'2. P&L'!AH90","v":0},{"$f":"'2. P&L'!AI90","v":0},{"$f":"'2. P&L'!AJ90","v":0},{"$f":"'2. P&L'!AK90","v":0},{"$f":"'2. P&L'!AL90","v":0},{"$f":"'2. P&L'!AM90","v":0},{"$f":"'2. P&L'!AN90","v":0},{"$f":"'2. P&L'!AO90","v":0},{"$f":"'2. P&L'!AP90","v":0},{"$f":"'2. P&L'!AQ90","v":0},{"$f":"'2. P&L'!AR90","v":0},{"$f":"'2. P&L'!AS90","v":0},{"$f":"'2. P&L'!AT90","v":0},{"$f":"'2. P&L'!AU90","v":0},{"$f":"'2. P&L'!AV90","v":0},{"$f":"'2. P&L'!AW90","v":0},{"$f":"'2. P&L'!AX90","v":0},{"$f":"'2. P&L'!AY90","v":0},{"$f":"'2. P&L'!AZ90","v":0},{"$f":"'2. P&L'!BA90","v":0},{"$f":"'2. P&L'!BB90","v":0},{"$f":"'2. P&L'!BC90","v":0},{"$f":"'2. P&L'!BD90","v":0},{"$f":"'2. P&L'!BE90","v":0},{"$f":"'2. P&L'!BF90","v":0},{"$f":"'2. P&L'!BG90","v":0},{"$f":"'2. P&L'!BH90","v":0},{"$f":"'2. P&L'!BI90","v":0},{"$f":"'2. P&L'!BJ90","v":0},{"$f":"'2. P&L'!BK90","v":0},{"$f":"'2. P&L'!BL90","v":0},{"$f":"'2. P&L'!BM90","v":0},{"$f":"'2. P&L'!BN90","v":0},{"$f":"'2. P&L'!BO90","v":0},{"$f":"'2. P&L'!BP90","v":0},{"$f":"'2. P&L'!BQ90","v":0},{"$f":"'2. P&L'!BR90","v":0},{"$f":"'2. P&L'!BS90","v":0},{"$f":"'2. P&L'!BT90","v":0},{"$f":"'2. P&L'!BU90","v":0},{"$f":"'2. P&L'!BV90","v":0},{"$f":"'2. P&L'!BW90","v":0},{"$f":"'2. P&L'!BX90","v":0},{"$f":"'2. P&L'!BY90","v":0},{"$f":"'2. P&L'!BZ90","v":0},{"$f":"'2. P&L'!CA90","v":0},{"$f":"'2. P&L'!CB90","v":0}]
["Variation du BFR","Données calculée à partir du bilan (sauf pour 2014, où la donnée doit être inscrite en dur)",null,null,null,null,null,{"$f":"-('4. Bilan & ratios'!H59-'4. Bilan & ratios'!F59)","v":0},{"$f":"-('4. Bilan & ratios'!I59-'4. Bilan & ratios'!G59)","v":0},{"$f":"-('4. Bilan & ratios'!J59-'4. Bilan & ratios'!I59)","v":0},{"$f":"-('4. Bilan & ratios'!K59-'4. Bilan & ratios'!J59)","v":0},{"$f":"-('4. Bilan & ratios'!L59-'4. Bilan & ratios'!K59)","v":0},{"$f":"-('4. Bilan & ratios'!M59-'4. Bilan & ratios'!L59)","v":0},{"$f":"-('4. Bilan & ratios'!N59-'4. Bilan & ratios'!M59)","v":0},{"$f":"-('4. Bilan & ratios'!O59-'4. Bilan & ratios'!N59)","v":0},{"$f":"-('4. Bilan & ratios'!P59-'4. Bilan & ratios'!O59)","v":0},{"$f":"-('4. Bilan & ratios'!Q59-'4. Bilan & ratios'!P59)","v":0},{"$f":"-('4. Bilan & ratios'!R59-'4. Bilan & ratios'!Q59)","v":0},{"$f":"-('4. Bilan & ratios'!S59-'4. Bilan & ratios'!R59)","v":0},{"$f":"-('4. Bilan & ratios'!T59-'4. Bilan & ratios'!S59)","v":0},{"$f":"-('4. Bilan & ratios'!U59-'4. Bilan & ratios'!T59)","v":0},{"$f":"-('4. Bilan & ratios'!V59-'4. Bilan & ratios'!U59)","v":0},{"$f":"-('4. Bilan & ratios'!W59-'4. Bilan & ratios'!V59)","v":0},{"$f":"-('4. Bilan & ratios'!X59-'4. Bilan & ratios'!W59)","v":0},{"$f":"-('4. Bilan & ratios'!Y59-'4. Bilan & ratios'!X59)","v":0},{"$f":"-('4. Bilan & ratios'!Z59-'4. Bilan & ratios'!Y59)","v":0},{"$f":"-('4. Bilan & ratios'!AA59-'4. Bilan & ratios'!Z59)","v":0},{"$f":"-('4. Bilan & ratios'!AB59-'4. Bilan & ratios'!AA59)","v":0},{"$f":"-('4. Bilan & ratios'!AC59-'4. Bilan & ratios'!AB59)","v":0},{"$f":"-('4. Bilan & ratios'!AD59-'4. Bilan & ratios'!AC59)","v":0},{"$f":"-('4. Bilan & ratios'!AE59-'4. Bilan & ratios'!AD59)","v":0},{"$f":"-('4. Bilan & ratios'!AF59-'4. Bilan & ratios'!AE59)","v":0},{"$f":"-('4. Bilan & ratios'!AG59-'4. Bilan & ratios'!AF59)","v":0},{"$f":"-('4. Bilan & ratios'!AH59-'4. Bilan & ratios'!AG59)","v":0},{"$f":"-('4. Bilan & ratios'!AI59-'4. Bilan & ratios'!AH59)","v":0},{"$f":"-('4. Bilan & ratios'!AJ59-'4. Bilan & ratios'!AI59)","v":0},{"$f":"-('4. Bilan & ratios'!AK59-'4. Bilan & ratios'!AJ59)","v":0},{"$f":"-('4. Bilan & ratios'!AL59-'4. Bilan & ratios'!AK59)","v":0},{"$f":"-('4. Bilan & ratios'!AM59-'4. Bilan & ratios'!AL59)","v":0},{"$f":"-('4. Bilan & ratios'!AN59-'4. Bilan & ratios'!AM59)","v":0},{"$f":"-('4. Bilan & ratios'!AO59-'4. Bilan & ratios'!AN59)","v":0},{"$f":"-('4. Bilan & ratios'!AP59-'4. Bilan & ratios'!AO59)","v":0},{"$f":"-('4. Bilan & ratios'!AQ59-'4. Bilan & ratios'!AP59)","v":0},{"$f":"-('4. Bilan & ratios'!AR59-'4. Bilan & ratios'!AQ59)","v":0},{"$f":"-('4. Bilan & ratios'!AS59-'4. Bilan & ratios'!AR59)","v":0},{"$f":"-('4. Bilan & ratios'!AT59-'4. Bilan & ratios'!AS59)","v":0},{"$f":"-('4. Bilan & ratios'!AU59-'4. Bilan & ratios'!AT59)","v":0},{"$f":"-('4. Bilan & ratios'!AV59-'4. Bilan & ratios'!AU59)","v":0},{"$f":"-('4. Bilan & ratios'!AW59-'4. Bilan & ratios'!AV59)","v":0},{"$f":"-('4. Bilan & ratios'!AX59-'4. Bilan & ratios'!AW59)","v":0},{"$f":"-('4. Bilan & ratios'!AY59-'4. Bilan & ratios'!AX59)","v":0},{"$f":"-('4. Bilan & ratios'!AZ59-'4. Bilan & ratios'!AY59)","v":0},{"$f":"-('4. Bilan & ratios'!BA59-'4. Bilan & ratios'!AZ59)","v":0},{"$f":"-('4. Bilan & ratios'!BB59-'4. Bilan & ratios'!BA59)","v":0},{"$f":"-('4. Bilan & ratios'!BC59-'4. Bilan & ratios'!BB59)","v":0},{"$f":"-('4. Bilan & ratios'!BD59-'4. Bilan & ratios'!BC59)","v":0},{"$f":"-('4. Bilan & ratios'!BE59-'4. Bilan & ratios'!BD59)","v":0},{"$f":"-('4. Bilan & ratios'!BF59-'4. Bilan & ratios'!BE59)","v":0},{"$f":"-('4. Bilan & ratios'!BG59-'4. Bilan & ratios'!BF59)","v":0},{"$f":"-('4. Bilan & ratios'!BH59-'4. Bilan & ratios'!BG59)","v":0},{"$f":"-('4. Bilan & ratios'!BI59-'4. Bilan & ratios'!BH59)","v":0},{"$f":"-('4. Bilan & ratios'!BJ59-'4. Bilan & ratios'!BI59)","v":0},{"$f":"-('4. Bilan & ratios'!BK59-'4. Bilan & ratios'!BJ59)","v":0},{"$f":"-('4. Bilan & ratios'!BL59-'4. Bilan & ratios'!BK59)","v":0},{"$f":"-('4. Bilan & ratios'!BM59-'4. Bilan & ratios'!BL59)","v":0},{"$f":"-('4. Bilan & ratios'!BN59-'4. Bilan & ratios'!BM59)","v":0},{"$f":"-('4. Bilan & ratios'!BO59-'4. Bilan & ratios'!BN59)","v":0},{"$f":"-('4. Bilan & ratios'!BP59-'4. Bilan & ratios'!BO59)","v":0},{"$f":"-('4. Bilan & ratios'!BQ59-'4. Bilan & ratios'!BP59)","v":0},{"$f":"-('4. Bilan & ratios'!BR59-'4. Bilan & ratios'!BQ59)","v":0},{"$f":"-('4. Bilan & ratios'!BS59-'4. Bilan & ratios'!BR59)","v":0},{"$f":"-('4. Bilan & ratios'!BT59-'4. Bilan & ratios'!BS59)","v":0},{"$f":"-('4. Bilan & ratios'!BU59-'4. Bilan & ratios'!BT59)","v":0},{"$f":"-('4. Bilan & ratios'!BV59-'4. Bilan & ratios'!BU59)","v":0},{"$f":"-('4. Bilan & ratios'!BW59-'4. Bilan & ratios'!BV59)","v":0},{"$f":"-('4. Bilan & ratios'!BX59-'4. Bilan & ratios'!BW59)","v":0},{"$f":"-('4. Bilan & ratios'!BY59-'4. Bilan & ratios'!BX59)","v":0},{"$f":"-('4. Bilan & ratios'!BZ59-'4. Bilan & ratios'!BY59)","v":0},{"$f":"-('4. Bilan & ratios'!CA59-'4. Bilan & ratios'!BZ59)","v":0},{"$f":"-('4. Bilan & ratios'!CB59-'4. Bilan & ratios'!CA59)","v":0}]
["CASH FLOW OPERATIONNELS /FFO",null,null,null,null,{"$f":"+SUM(F5:F11)","v":0},0,0,{"$f":"+SUM(I5:I11)","v":0},0,0,0,0,0,0,0,0,0,0,0,0,0,0,0,0,{"$f":"+SUM(Z5:Z11)","v":0},0,0,0,0,0,0,0,0,0,0,0,0,0,0,0,0,0,0,0,0,0,0,0,0,0,0,0,0,0,0,0,0,0,0,0,0,0,0,0,0,0,0,0,0,0,0,0,0,0,0,0,0,0,0]
["Acquisitions d’immobilisations","Le check vérifie la cohérence entre le montant d'investissement inscrit dans le tableau de Cash Flow et le Pg d'investissement",null,null,{"$f":"'9. Checks (ARAFER)'!E27","v":"OK"},{"$f":"SUM(F14:F15)","v":0},{"$f":"SUM(G14:G15)","v":0},0,{"$f":"SUM(I14:I15)","v":0},{"$f":"SUM(J14:J15)","v":0},{"$f":"SUM(K14:K15)","v":0},0,0,0,0,0,0,0,0,0,0,0,0,0,0,{"$f":"SUM(Z14:Z15)","v":0},0,0,0,0,0,0,0,0,0,0,0,0,0,0,0,0,0,0,0,0,0,0,0,0,0,0,0,0,0,0,0,0,0,0,0,0,0,0,0,0,0,0,0,0,0,0,0,0,0,0,0,0,0,0]
["- Immobilisations non renouvelables ou ICAS","Regroupe les investissements qui sont amortis en caducité"]
["- Immobilisations  renouvelables ou IEAS","Regroupe les investissements amortis sur leur durée de vie propre (logiciels, matériel, équipements péages, véhicules, couches de roulement de chaussées…) "]
["Cessions d’immobilisations"]
["Acquisition  / cession d'Immobilisations financières"]
["FLUX NETS DE TRESORERIE LIES AUX\nOPERATIONS D'INVESTISSEMENTS",null,null,null,null,{"$f":"F13+F16+F17","v":0},0,0,{"$f":"I13+I16+I17","v":0},0,0,0,0,0,0,0,0,0,0,0,0,0,0,0,0,{"$f":"Z13+Z16+Z17","v":0},0,0,0,0,0,0,0,0,0,0,0,0,0,0,0,0,0,0,0,0,0,0,0,0,0,0,0,0,0,0,0,0,0,0,0,0,0,0,0,0,0,0,0,0,0,0,0,0,0,0,0,0,0,0]
["Dividendes versés",null,null,null,null,{"$f":"+F20+F21","v":0},0,0,{"$f":"+I20+I21","v":0},0,0,0,0,0,0,0,0,0,0,{"$f":"+T20+T21","v":0},{"$f":"+U20+U21","v":0},{"$f":"+V20+V21","v":0},{"$f":"+W20+W21","v":0},{"$f":"+X20+X21","v":0},{"$f":"+Y20+Y21","v":0},0,0,0,0,0,0,0,0,0,0,0,0,0,0,0,0,0,0,0,0,0,0,0,0,0,0,0,0,0,0,0,0,0,0,0,0,0,0,0,0,0,0,0,0,0,0,0,0,0,0,0,0,0,0,0]
["dont dividende au titre du résultat de l'exercice N-1"]
["dont acompte sur dividende"]
["Subventions d'investissement reçues"]
["Emission Nouveaux Emprunts","Ne pas netter émission et remboursement de nouveaux emprunts"]
["Remboursement emprunts"]
["Prime  sur opération de refinancement","Soulte décaissée lors d'opération de refinancement"]
["Opérations en capital"]
["Opérations sur comptes de réserve"]
["FLUX NETS DE TRESORERIE LIES AUX\nOPERATIONS DE FINANCEMENT",null,null,null,null,{"$f":"F19+SUM(F22:F27)","v":0},0,0,0,0,0,0,0,0,0,0,0,0,0,0,0,0,0,0,0,{"$f":"Z19+SUM(Z22:Z27)","v":0},0,0,0,0,0,0,0,0,0,0,0,0,0,0,0,0,0,0,0,0,0,0,0,0,0,0,0,0,0,0,0,0,0,0,0,0,0,0,0,0,0,0,0,0,0,0,0,0,0,0,0,0,0,0]
[]
["VARIATION DE TRESORERIE",null,null,null,null,{"$f":"F28+F18+F12","v":0},0,0,{"$f":"I28+I18+I12","v":0},0,{"$f":"K28+K18+K12","v":0},0,0,0,0,0,0,0,0,{"$f":"T28+T18+T12","v":0},{"$f":"U28+U18+U12","v":0},{"$f":"V28+V18+V12","v":0},{"$f":"W28+W18+W12","v":0},{"$f":"X28+X18+X12","v":0},{"$f":"Y28+Y18+Y12","v":0},0,0,0,0,0,0,0,0,0,0,0,0,0,0,0,0,0,0,0,0,0,0,0,0,0,0,0,0,0,0,0,0,0,0,0,0,0,0,0,0,0,0,0,0,0,0,0,0,0,0,0,0,0,0,0]
[]
["TRESORERIE D'OUVERTURE",null,null,null,null,null,null,{"$f":"G33","v":0},{"$f":"G33","v":0},{"$f":"I33","v":0},{"$f":"J33","v":0},0,0,0,0,0,0,0,0,0,0,0,0,0,0,{"$f":"Y33","v":0},{"$f":"Z33","v":0},{"$f":"AA33","v":0},{"$f":"AB33","v":0},{"$f":"AC33","v":0},{"$f":"AD33","v":0},{"$f":"AE33","v":0},{"$f":"AF33","v":0},{"$f":"AG33","v":0},{"$f":"AH33","v":0},{"$f":"AI33","v":0},{"$f":"AJ33","v":0},{"$f":"AK33","v":0},{"$f":"AL33","v":0},{"$f":"AM33","v":0},{"$f":"AN33","v":0},{"$f":"AO33","v":0},{"$f":"AP33","v":0},{"$f":"AQ33","v":0},{"$f":"AR33","v":0},{"$f":"AS33","v":0},{"$f":"AT33","v":0},{"$f":"AU33","v":0},{"$f":"AV33","v":0},{"$f":"AW33","v":0},{"$f":"AX33","v":0},{"$f":"AY33","v":0},{"$f":"AZ33","v":0},{"$f":"BA33","v":0},{"$f":"BB33","v":0},{"$f":"BC33","v":0},{"$f":"BD33","v":0},{"$f":"BE33","v":0},{"$f":"BF33","v":0},{"$f":"BG33","v":0},{"$f":"BH33","v":0},{"$f":"BI33","v":0},{"$f":"BJ33","v":0},{"$f":"BK33","v":0},{"$f":"BL33","v":0},{"$f":"BM33","v":0},{"$f":"BN33","v":0},{"$f":"BO33","v":0},{"$f":"BP33","v":0},{"$f":"BQ33","v":0},{"$f":"BR33","v":0},{"$f":"BS33","v":0},{"$f":"BT33","v":0},{"$f":"BU33","v":0},{"$f":"BV33","v":0},{"$f":"BW33","v":0},{"$f":"BX33","v":0},{"$f":"BY33","v":0},{"$f":"BZ33","v":0},{"$f":"CA33","v":0}]
["TRESORERIE DE CLOTURE","Le check vérifie que le cumul de Trésorerie à chaque fin d'exercice est positif ou nul.",null,null,{"$f":"'9. Checks (ARAFER)'!E29","v":"OK"},{"$f":"F32+F30","v":0},{"$f":"G32+G30","v":0},0,{"$f":"I32+I30","v":0},{"$f":"J32+J30","v":0},0,0,0,0,0,0,0,0,0,0,0,0,0,0,0,{"$f":"Z32+Z30","v":0},0,0,0,0,0,0,0,0,0,0,0,0,0,0,0,0,0,0,0,0,0,0,0,0,0,0,0,0,0,0,0,0,0,0,0,0,0,0,0,0,0,0,0,0,0,0,0,0,0,0,0,0,0,0]
[]
[]
["CONTROLE"]
[]
["Checks P&L et CF"]
[]
["Check Ebit","Cohérence entre Ebit du P&L et celui du tableau de Cash Flow",null,null,{"$f":"'9. Checks (ARAFER)'!E53","v":"OK"}]
[]
["Check amortissements et provisions","Vérification que le montant des amortissements et provisions du P&L est identique à celui du tableau de Cash Flow",null,null,{"$f":"'9. Checks (ARAFER)'!E55","v":"OK"}]

{"sheet":"4. Bilan & ratios","index":4,"n_rows":122,"n_cols":80,"rows_kept":122,"cut":false,"hidden":false,"merged":[[1,0,1,27],[101,0,101,27],[10,3,11,3],[18,3,19,3]]}
[{"$f":"'1. Info'!$D$5","v":0},null,null,null,null,null,null,null,null,null,null,null,null,null,null,null,null,null,null,null,null,null,null,null,null,null,null,"Date"]
["Bilan"]
[]
["( en M€ courants)  ","Aide à la saisie","Commentaires SCA","Ref liasse Fiscale quand applicable - Formulaire Cerfa n°2050","Checks","2015 (p)","2015 (r)","2016 (p)","2016 (r)","2017 (p)","2018 (p)","2019 (p)","2020 (p)","2021 (p)","2022 (p)","2023 (p)","2024 (p)","2025 (p)","2026 (p)","2027 (p)","2028 (p)","2029 (p)","2030 (p)","2031 (p)","2032 (p)","2033 (p)","2034 (p)","2035 (p)","2036 (p)","2037 (p)","2038 (p)","2039 (p)","2040 (p)","2041 (p)","2042 (p)","2043 (p)","2044 (p)","2045 (p)","2046 (p)","2047 (p)","2048 (p)","2049 (p)","2050 (p)","2051 (p)","2052 (p)","2053 (p)","2054 (p)","2055 (p)","2056 (p)","2057 (p)","2058 (p)","2059 (p)","2060 (p)","2061 (p)","2062 (p)","2063 (p)","2064 (p)","2065 (p)","2066 (p)","2067 (p)","2068 (p)","2069 (p)","2070 (p)","2071 (p)","2072 (p)","2073 (p)","2074 (p)","2075 (p)","2076 (p)","2077 (p)","2078 (p)","2079 (p)","2080 (p)","2081 (p)","2082 (p)","2083 (p)","2084 (p)","2085 (p)","2086 (p)","2087 (p)"]
["ACTIF",null,null," CO - BK",null,{"$f":"+F7+F16","v":0},0,0,0,0,0,0,0,0,0,0,0,0,0,0,0,0,0,0,0,{"$f":"+Z7+Z16","v":0},0,0,0,0,0,0,0,0,0,0,0,0,0,0,0,0,0,0,0,0,0,0,0,0,0,0,0,0,0,0,0,0,0,0,0,0,0,0,0,0,0,0,0,0,0,0,0,0,0,0,0,0,0,0]
[]
["Actif immobilisé",null,null," BJ - BK",null,{"$f":"F8+F9+F10","v":0},0,0,0,0,0,0,0,0,0,0,0,0,0,{"$f":"T8+T9+T10","v":0},0,0,0,0,0,{"$f":"Z8+Z9+Z10","v":0},0,0,0,0,0,0,0,0,0,0,0,0,0,0,0,0,0,0,0,0,0,0,0,0,0,0,0,0,0,0,0,0,0,0,0,0,0,0,0,0,0,0,0,0,0,0,0,0,0,0,0,0,0,0]
["Immobilisations incorporelles (nettes)",null,null,"Σ AB à AL - Σ AC à AM"]
["Immobilisations corporelles du domaine concédé (nettes)",null,null,"Σ AN à AX - Σ AO à AY"]
["Immobilisations financières (nettes)","Le check vérifie que le total est égal au détail",null,null,{"$f":"'9. Checks (ARAFER)'!E34","v":"OK"},null,{"$f":"SUM(G11:G15)","v":0},null,0]
["dont titres de participations dans sociétés consolidées",null,null,"CS, CU et BD"]
["dont titres de participations dans sociétés mises en équivalences"]
["dont créances rattachées à des participations",null,null,"BB"]
["dont prêts",null,null,"BF"]
["dont autre","Détail à préciser",null,"BH"]
["Actif circulant",null,null,null,null,{"$f":"+F20+F21","v":0},{"$f":"SUM(G17:G21)","v":0},{"$f":"+H20+H21","v":0},0,{"$f":"+J20+J21","v":0},{"$f":"+K20+K21","v":0},0,0,0,0,0,0,0,0,0,0,0,0,0,0,{"$f":"+Z20+Z21","v":0},0,0,0,0,0,0,0,0,0,0,0,0,0,0,0,0,0,0,0,0,0,0,0,0,0,0,0,0,0,0,0,0,0,0,0,0,0,0,0,0,0,0,0,0,0,0,0,0,0,0,0,0,0,0]
["Stocks",null,null,"Σ  BL à BT"]
["Créances clients ","Créances clients et comptes rattachés",null,"BX"]
["Créances sociales et fiscales",null,null,"BV, BZ, CH et Σ CW à CN"]
["Autres créances et comptes de régularisation","Préciser le type de créance en commentaire"]
["Trésorerie","VMP et disponibilités (y compris comptes de réserve)",null,"CD et CF"]
["dont comptes de réserve"]
[]
["( en M€ courants)  ","Aide à la saisie","Commentaires SCA","Ref liasse Fiscale quand applicable - Formulaire Cerfa n°2051","Checks","2015 (p)","2015 (r)","2016 (p)","2016 (r)","2017 (p)","2018 (p)","2019 (p)","2020 (p)","2021 (p)","2022 (p)","2023 (p)","2024 (p)","2025 (p)","2026 (p)","2027 (p)","2028 (p)","2029 (p)","2030 (p)","2031 (p)","2032 (p)","2033 (p)","2034 (p)","2035 (p)","2036 (p)","2037 (p)","2038 (p)","2039 (p)","2040 (p)","2041 (p)","2042 (p)","2043 (p)","2044 (p)","2045 (p)","2046 (p)","2047 (p)","2048 (p)","2049 (p)","2050 (p)","2051 (p)","2052 (p)","2053 (p)","2054 (p)","2055 (p)","2056 (p)","2057 (p)","2058 (p)","2059 (p)","2060 (p)","2061 (p)","2062 (p)","2063 (p)","2064 (p)","2065 (p)","2066 (p)","2067 (p)","2068 (p)","2069 (p)","2070 (p)","2071 (p)","2072 (p)","2073 (p)","2074 (p)","2075 (p)","2076 (p)","2077 (p)","2078 (p)","2079 (p)","2080 (p)","2081 (p)","2082 (p)","2083 (p)","2084 (p)","2085 (p)","2086 (p)","2087 (p)"]
["PASSIF",null,null,"EE",null,{"$f":"+F27+F34+F35+F40+F49","v":0},0,0,0,0,0,0,0,0,0,0,0,0,0,0,0,0,0,0,0,{"$f":"+Z27+Z34+Z35+Z40+Z49","v":0},0,0,0,0,0,0,0,0,0,0,0,0,0,0,0,0,0,0,0,0,0,0,0,0,0,0,0,0,0,0,0,0,0,0,0,0,0,0,0,0,0,0,0,0,0,0,0,0,0,0,0,0,0,0]
[]
["Capitaux propres",null,null,"DL",null,{"$f":"SUM(F28:F33)","v":0},{"$f":"SUM(G28:G33)","v":0},0,0,0,0,0,0,0,0,0,0,0,0,{"$f":"SUM(T28:T33)","v":0},0,0,0,0,0,{"$f":"SUM(Z28:Z33)","v":0},0,0,0,0,0,0,0,0,0,0,0,0,0,0,0,0,0,0,0,0,0,0,0,0,0,0,0,0,0,0,0,0,0,0,0,0,0,0,0,0,0,0,0,0,0,0,0,0,0,0,0,0,0,0]
["Capital social",null,null,"DA"]
["Primes et réserves",null,null,"Σ DB à DG"]
["Report à nouveau",null,null,"DH"]
["Résultat de l'exercice",null,null,"DI"]
["Subventions d'investissement",null,null,"DJ"]
["Provisions réglementées",null,null,"DK"]
["Autres Fonds Propres","Correspond aux apports gratuits effectués par le concédant",null,"DO"]
["Provisions pour risques et charges","Le check vérifie que le total est égal au détail",null,"DR",{"$f":"'9. Checks (ARAFER)'!E36","v":"OK"},null,{"$f":"SUM(G36:G39)","v":0},null,0]
["dont provisions pour indemnités de fin de carrière"]
["dont provisions pour gros entretien"]
["dont provisions pour indexation d'emprunts"]
["dont autres provisions pour risques et charges"]
["Emprunts et dettes financières","Le check vérifie que le total est égal au détail",null,"Σ DS à DV",{"$f":"'9. Checks (ARAFER)'!E38","v":"OK"},null,{"$f":"SUM(G41:G48)","v":0},null,0]
["dont emprunts ","Emprunts obligataires et bancaires hors groupe"]
["dont ligne de crédit externe","Ligne de crédit tirée"]
["dont ligne de crédit intragroupe"]
["dont dettes de trésorerie","Billets de trésorerie"]
["dont prêt intragroupe / C/C associés"]
["dont ICNE"]
["dont C/C de cash pooling","Comptes courants fonctionnant dans le cadre d'une convention de trésorerie intragroupe (montant net : dette-créance). S'il y a seulement une créance, alors le montant est négatif"]
["dont autres","Avances de l'Etat, dépôts et cautionnement"]
["Passif circulant",null,null,null,null,null,{"$f":"SUM(G50:G53)","v":0},null,0]
["Dettes sur immobilisations",null,null,"DZ"]
["Dettes fournisseurs",null,null,"DW et DX"]
["Dettes fiscales et sociales",null,null,"DY"]
["Autres dettes","Produits constatés d'avance, Participations des Salariés, autres à préciser en commentaires",null,"EA, EB et ED"]
[]
["Eléments Hors Bilan"]
["Stock de reports déficitaires"]
[]
["Agrégats"]
["BFR",null,null,null,null,null,{"$f":"SUM(G17:G20)-G49","v":0},{"$f":"SUM(H17:H20)-H49","v":0},0,0,0,0,0,0,0,0,0,0,0,0,0,0,0,0,0,{"$f":"SUM(Z17:Z20)-Z49","v":0},0,0,0,0,0,0,0,0,0,0,0,0,0,0,0,0,0,0,0,0,0,0,0,0,0,0,0,0,0,0,0,0,0,0,0,0,0,0,0,0,0,0,0,0,0,0,0,0,0,0,0,0,0,0]
[]
["Capitaux investis","Moyenne Actif immobilisé (n-1 et n) + BFR",null,null,null,null,null,{"$f":"AVERAGE(H7,G7)+H59","v":0},{"$f":"AVERAGE(I7,G7)+I59","v":0},{"$f":"AVERAGE(J7,I7)+J59","v":0},0,0,0,0,0,0,0,0,0,0,0,0,0,0,0,{"$f":"AVERAGE(Z7,Y7)+Z59","v":0},{"$f":"AVERAGE(AA7,Z7)+AA59","v":0},{"$f":"AVERAGE(AB7,AA7)+AB59","v":0},{"$f":"AVERAGE(AC7,AB7)+AC59","v":0},{"$f":"AVERAGE(AD7,AC7)+AD59","v":0},{"$f":"AVERAGE(AE7,AD7)+AE59","v":0},{"$f":"AVERAGE(AF7,AE7)+AF59","v":0},{"$f":"AVERAGE(AG7,AF7)+AG59","v":0},{"$f":"AVERAGE(AH7,AG7)+AH59","v":0},{"$f":"AVERAGE(AI7,AH7)+AI59","v":0},{"$f":"AVERAGE(AJ7,AI7)+AJ59","v":0},{"$f":"AVERAGE(AK7,AJ7)+AK59","v":0},{"$f":"AVERAGE(AL7,AK7)+AL59","v":0},{"$f":"AVERAGE(AM7,AL7)+AM59","v":0},{"$f":"AVERAGE(AN7,AM7)+AN59","v":0},{"$f":"AVERAGE(AO7,AN7)+AO59","v":0},{"$f":"AVERAGE(AP7,AO7)+AP59","v":0},{"$f":"AVERAGE(AQ7,AP7)+AQ59","v":0},{"$f":"AVERAGE(AR7,AQ7)+AR59","v":0},{"$f":"AVERAGE(AS7,AR7)+AS59","v":0},{"$f":"AVERAGE(AT7,AS7)+AT59","v":0},{"$f":"AVERAGE(AU7,AT7)+AU59","v":0},{"$f":"AVERAGE(AV7,AU7)+AV59","v":0},{"$f":"AVERAGE(AW7,AV7)+AW59","v":0},{"$f":"AVERAGE(AX7,AW7)+AX59","v":0},{"$f":"AVERAGE(AY7,AX7)+AY59","v":0},{"$f":"AVERAGE(AZ7,AY7)+AZ59","v":0},{"$f":"AVERAGE(BA7,AZ7)+BA59","v":0},{"$f":"AVERAGE(BB7,BA7)+BB59","v":0},{"$f":"AVERAGE(BC7,BB7)+BC59","v":0},{"$f":"AVERAGE(BD7,BC7)+BD59","v":0},{"$f":"AVERAGE(BE7,BD7)+BE59","v":0},{"$f":"AVERAGE(BF7,BE7)+BF59","v":0},{"$f":"AVERAGE(BG7,BF7)+BG59","v":0},{"$f":"AVERAGE(BH7,BG7)+BH59","v":0},{"$f":"AVERAGE(BI7,BH7)+BI59","v":0},{"$f":"AVERAGE(BJ7,BI7)+BJ59","v":0},{"$f":"AVERAGE(BK7,BJ7)+BK59","v":0},{"$f":"AVERAGE(BL7,BK7)+BL59","v":0},{"$f":"AVERAGE(BM7,BL7)+BM59","v":0},{"$f":"AVERAGE(BN7,BM7)+BN59","v":0},{"$f":"AVERAGE(BO7,BN7)+BO59","v":0},{"$f":"AVERAGE(BP7,BO7)+BP59","v":0},{"$f":"AVERAGE(BQ7,BP7)+BQ59","v":0},{"$f":"AVERAGE(BR7,BQ7)+BR59","v":0},{"$f":"AVERAGE(BS7,BR7)+BS59","v":0},{"$f":"AVERAGE(BT7,BS7)+BT59","v":0},{"$f":"AVERAGE(BU7,BT7)+BU59","v":0},{"$f":"AVERAGE(BV7,BU7)+BV59","v":0},{"$f":"AVERAGE(BW7,BV7)+BW59","v":0},{"$f":"AVERAGE(BX7,BW7)+BX59","v":0},{"$f":"AVERAGE(BY7,BX7)+BY59","v":0},{"$f":"AVERAGE(BZ7,BY7)+BZ59","v":0},{"$f":"AVERAGE(CA7,BZ7)+CA59","v":0},{"$f":"AVERAGE(CB7,CA7)+CB59","v":0}]
[]
["Dette Financière brute","Emprunt et dettes financières figurant au passif",null,null,null,{"$f":"F40","v":0},0,0,0,0,0,0,0,0,0,0,0,0,0,0,0,0,0,0,0,{"$f":"Z40","v":0},0,0,0,0,0,0,0,0,0,0,0,0,0,0,0,0,0,0,0,0,0,0,0,0,0,0,0,0,0,0,0,0,0,0,0,0,0,0,0,0,0,0,0,0,0,0,0,0,0,0,0,0,0,0]
[]
["Dette Financière Nette","Emprunt et dettes financières nettés de la trésorerie",null,null,null,{"$f":"F40-F21","v":0},0,0,{"$f":"I40-I21","v":0},0,0,0,0,0,0,0,0,0,0,0,0,0,0,0,0,{"$f":"Z40-Z21","v":0},0,0,0,0,0,0,0,0,0,0,0,0,0,0,0,0,0,0,0,0,0,0,0,0,0,0,0,0,0,0,0,0,0,0,0,0,0,0,0,0,0,0,0,0,0,0,0,0,0,0,0,0,0,0]
[]
[]
[]
["CONTROLE"]
[]
["Check Bilan"]
[]
["Check équilibre du bilan","Actif = Passif",null,null,{"$f":"'9. Checks (ARAFER)'!E40","v":"OK"}]
[]
["Check VNC immobilisations coporelles = 0","Vérification que l'actif corporel du domaine concédé est intégralement amorti en fin de concession",null,null,{"$f":"'9. Checks (ARAFER)'!E42","v":"CHECK"}]
[]
["Check immobilisations financières >= 0","Vérifie que le montant des immobilisations financières inscrites à l'actif du bilan est toujours positif ou nul",null,null,{"$f":"'9. Checks (ARAFER)'!E44","v":"OK"}]
[]
["Check subventions= 0","Vérification que les subventions d'investissements sont intégralement amorties en fin de concession",null,null,{"$f":"'9. Checks (ARAFER)'!E46","v":"CHECK"}]
[]
["Check emprunts et dettes financières >= 0","Vérifie que le montant du poste Emprunts et dettes financières au passif du bilan est toujours positif ou nul",null,null,{"$f":"'9. Checks (ARAFER)'!E48","v":"OK"}]
[]
[]
["Check Bilan et Dette"]
[]
["Check dette 31/12/2016","Vérifie la cohérence du montant d'emprunts et dettes fianncières inscrits au passif avec le détail d el'onglet Dette",null,null,{"$f":"'9. Checks (ARAFER)'!E60","v":"OK"}]
[]
[]
["Checks Bilan et CF"]
[]
["Check trésorerie","Vérifie la cohérence entre le montant de trésorerie de clôture  du tableau de Cash Flow et la trésorerie à l'actif du bilan",null,null,{"$f":"'9. Checks (ARAFER)'!E65","v":"OK"}]
[]
["Check BFR","Vérifie la cohérence entre la variation de BFR inscrite dans le tableau de Cafh Flow et les montants de BFR du bilan",null,null,{"$f":"'9. Checks (ARAFER)'!E67","v":"OK"}]
[]
["Check mouvements de dette","Vérification que les mouvements de dette annuels expliquent la variation de dette financière au bilan",null,null,{"$f":"'9. Checks (ARAFER)'!E69","v":"OK"}]
[]
["Check réconciliation immobilisations incorporelles et corporelles","Vérifie la cohérence des mouvements d'immobilisations au bilan avec les investissements (CF) et les amortissements (P&L)",null,null,{"$f":"'9. Checks (ARAFER)'!E72","v":"OK"}]
[]
[]
[]
[]
["Données clés et Ratios"]
[]
[" ",null,null,null,null,"2015 (p)","2015 (r)","2016 (p)","2016 (r)","2017 (p)","2018 (p)","2019 (p)","2020 (p)","2021 (p)","2022 (p)","2023 (p)","2024 (p)","2025 (p)","2026 (p)","2027 (p)","2028 (p)","2029 (p)","2030 (p)","2031 (p)","2032 (p)","2033 (p)","2034 (p)","2035 (p)","2036 (p)","2037 (p)","2038 (p)","2039 (p)","2040 (p)","2041 (p)","2042 (p)","2043 (p)","2044 (p)","2045 (p)","2046 (p)","2047 (p)","2048 (p)","2049 (p)","2050 (p)","2051 (p)","2052 (p)","2053 (p)","2054 (p)","2055 (p)","2056 (p)","2057 (p)","2058 (p)","2059 (p)","2060 (p)","2061 (p)","2062 (p)","2063 (p)","2064 (p)","2065 (p)","2066 (p)","2067 (p)","2068 (p)","2069 (p)","2070 (p)","2071 (p)","2072 (p)","2073 (p)","2074 (p)","2075 (p)","2076 (p)","2077 (p)","2078 (p)","2079 (p)","2080 (p)","2081 (p)","2082 (p)","2083 (p)","2084 (p)","2085 (p)","2086 (p)","2087 (p)"]
["EBITDA",null,null,null,null,{"$f":"'2. P&L'!F76","v":0},{"$f":"'2. P&L'!G76","v":0},{"$f":"'2. P&L'!H76","v":0},{"$f":"'2. P&L'!I76","v":0},{"$f":"'2. P&L'!J76","v":0},{"$f":"'2. P&L'!K76","v":0},{"$f":"'2. P&L'!L76","v":0},{"$f":"'2. P&L'!M76","v":0},{"$f":"'2. P&L'!N76","v":0},{"$f":"'2. P&L'!O76","v":0},{"$f":"'2. P&L'!P76","v":0},{"$f":"'2. P&L'!Q76","v":0},{"$f":"'2. P&L'!R76","v":0},{"$f":"'2. P&L'!S76","v":0},{"$f":"'2. P&L'!T76","v":0},{"$f":"'2. P&L'!U76","v":0},{"$f":"'2. P&L'!V76","v":0},{"$f":"'2. P&L'!W76","v":0},{"$f":"'2. P&L'!X76","v":0},{"$f":"'2. P&L'!Y76","v":0},{"$f":"'2. P&L'!Z76","v":0},{"$f":"'2. P&L'!AA76","v":0},{"$f":"'2. P&L'!AB76","v":0},{"$f":"'2. P&L'!AC76","v":0},{"$f":"'2. P&L'!AD76","v":0},{"$f":"'2. P&L'!AE76","v":0},{"$f":"'2. P&L'!AF76","v":0},{"$f":"'2. P&L'!AG76","v":0},{"$f":"'2. P&L'!AH76","v":0},{"$f":"'2. P&L'!AI76","v":0},{"$f":"'2. P&L'!AJ76","v":0},{"$f":"'2. P&L'!AK76","v":0},{"$f":"'2. P&L'!AL76","v":0},{"$f":"'2. P&L'!AM76","v":0},{"$f":"'2. P&L'!AN76","v":0},{"$f":"'2. P&L'!AO76","v":0},{"$f":"'2. P&L'!AP76","v":0},{"$f":"'2. P&L'!AQ76","v":0},{"$f":"'2. P&L'!AR76","v":0},{"$f":"'2. P&L'!AS76","v":0},{"$f":"'2. P&L'!AT76","v":0},{"$f":"'2. P&L'!AU76","v":0},{"$f":"'2. P&L'!AV76","v":0},{"$f":"'2. P&L'!AW76","v":0},{"$f":"'2. P&L'!AX76","v":0},{"$f":"'2. P&L'!AY76","v":0},{"$f":"'2. P&L'!AZ76","v":0},{"$f":"'2. P&L'!BA76","v":0},{"$f":"'2. P&L'!BB76","v":0},{"$f":"'2. P&L'!BC76","v":0},{"$f":"'2. P&L'!BD76","v":0},{"$f":"'2. P&L'!BE76","v":0},{"$f":"'2. P&L'!BF76","v":0},{"$f":"'2. P&L'!BG76","v":0},{"$f":"'2. P&L'!BH76","v":0},{"$f":"'2. P&L'!BI76","v":0},{"$f":"'2. P&L'!BJ76","v":0},{"$f":"'2. P&L'!BK76","v":0},{"$f":"'2. P&L'!BL76","v":0},{"$f":"'2. P&L'!BM76","v":0},{"$f":"'2. P&L'!BN76","v":0},{"$f":"'2. P&L'!BO76","v":0},{"$f":"'2. P&L'!BP76","v":0},{"$f":"'2. P&L'!BQ76","v":0},{"$f":"'2. P&L'!BR76","v":0},{"$f":"'2. P&L'!BS76","v":0},{"$f":"'2. P&L'!BT76","v":0},{"$f":"'2. P&L'!BU76","v":0},{"$f":"'2. P&L'!BV76","v":0},{"$f":"'2. P&L'!BW76","v":0},{"$f":"'2. P&L'!BX76","v":0},{"$f":"'2. P&L'!BY76","v":0},{"$f":"'2. P&L'!BZ76","v":0},{"$f":"'2. P&L'!CA76","v":0},{"$f":"'2. P&L'!CB76","v":0}]
["EBIT",null,null,null,null,{"$f":"'2. P&L'!F87","v":0},{"$f":"'2. P&L'!G87","v":0},{"$f":"'2. P&L'!H87","v":0},{"$f":"'2. P&L'!I87","v":0},{"$f":"'2. P&L'!J87","v":0},{"$f":"'2. P&L'!K87","v":0},{"$f":"'2. P&L'!L87","v":0},{"$f":"'2. P&L'!M87","v":0},{"$f":"'2. P&L'!N87","v":0},{"$f":"'2. P&L'!O87","v":0},{"$f":"'2. P&L'!P87","v":0},{"$f":"'2. P&L'!Q87","v":0},{"$f":"'2. P&L'!R87","v":0},{"$f":"'2. P&L'!S87","v":0},{"$f":"'2. P&L'!T87","v":0},{"$f":"'2. P&L'!U87","v":0},{"$f":"'2. P&L'!V87","v":0},{"$f":"'2. P&L'!W87","v":0},{"$f":"'2. P&L'!X87","v":0},{"$f":"'2. P&L'!Y87","v":0},{"$f":"'2. P&L'!Z87","v":0},{"$f":"'2. P&L'!AA87","v":0},{"$f":"'2. P&L'!AB87","v":0},{"$f":"'2. P&L'!AC87","v":0},{"$f":"'2. P&L'!AD87","v":0},{"$f":"'2. P&L'!AE87","v":0},{"$f":"'2. P&L'!AF87","v":0},{"$f":"'2. P&L'!AG87","v":0},{"$f":"'2. P&L'!AH87","v":0},{"$f":"'2. P&L'!AI87","v":0},{"$f":"'2. P&L'!AJ87","v":0},{"$f":"'2. P&L'!AK87","v":0},{"$f":"'2. P&L'!AL87","v":0},{"$f":"'2. P&L'!AM87","v":0},{"$f":"'2. P&L'!AN87","v":0},{"$f":"'2. P&L'!AO87","v":0},{"$f":"'2. P&L'!AP87","v":0},{"$f":"'2. P&L'!AQ87","v":0},{"$f":"'2. P&L'!AR87","v":0},{"$f":"'2. P&L'!AS87","v":0},{"$f":"'2. P&L'!AT87","v":0},{"$f":"'2. P&L'!AU87","v":0},{"$f":"'2. P&L'!AV87","v":0},{"$f":"'2. P&L'!AW87","v":0},{"$f":"'2. P&L'!AX87","v":0},{"$f":"'2. P&L'!AY87","v":0},{"$f":"'2. P&L'!AZ87","v":0},{"$f":"'2. P&L'!BA87","v":0},{"$f":"'2. P&L'!BB87","v":0},{"$f":"'2. P&L'!BC87","v":0},{"$f":"'2. P&L'!BD87","v":0},{"$f":"'2. P&L'!BE87","v":0},{"$f":"'2. P&L'!BF87","v":0},{"$f":"'2. P&L'!BG87","v":0},{"$f":"'2. P&L'!BH87","v":0},{"$f":"'2. P&L'!BI87","v":0},{"$f":"'2. P&L'!BJ87","v":0},{"$f":"'2. P&L'!BK87","v":0},{"$f":"'2. P&L'!BL87","v":0},{"$f":"'2. P&L'!BM87","v":0},{"$f":"'2. P&L'!BN87","v":0},{"$f":"'2. P&L'!BO87","v":0},{"$f":"'2. P&L'!BP87","v":0},{"$f":"'2. P&L'!BQ87","v":0},{"$f":"'2. P&L'!BR87","v":0},{"$f":"'2. P&L'!BS87","v":0},{"$f":"'2. P&L'!BT87","v":0},{"$f":"'2. P&L'!BU87","v":0},{"$f":"'2. P&L'!BV87","v":0},{"$f":"'2. P&L'!BW87","v":0},{"$f":"'2. P&L'!BX87","v":0},{"$f":"'2. P&L'!BY87","v":0},{"$f":"'2. P&L'!BZ87","v":0},{"$f":"'2. P&L'!CA87","v":0},{"$f":"'2. P&L'!CB87","v":0}]
["Frais Financiers",null,null,null,null,{"$f":"'2. P&L'!F96","v":0},{"$f":"'2. P&L'!G96","v":0},{"$f":"'2. P&L'!H96","v":0},{"$f":"'2. P&L'!I96","v":0},{"$f":"'2. P&L'!J96","v":0},{"$f":"'2. P&L'!K96","v":0},{"$f":"'2. P&L'!L96","v":0},{"$f":"'2. P&L'!M96","v":0},{"$f":"'2. P&L'!N96","v":0},{"$f":"'2. P&L'!O96","v":0},{"$f":"'2. P&L'!P96","v":0},{"$f":"'2. P&L'!Q96","v":0},{"$f":"'2. P&L'!R96","v":0},{"$f":"'2. P&L'!S96","v":0},{"$f":"'2. P&L'!T96","v":0},{"$f":"'2. P&L'!U96","v":0},{"$f":"'2. P&L'!V96","v":0},{"$f":"'2. P&L'!W96","v":0},{"$f":"'2. P&L'!X96","v":0},{"$f":"'2. P&L'!Y96","v":0},{"$f":"'2. P&L'!Z96","v":0},{"$f":"'2. P&L'!AA96","v":0},{"$f":"'2. P&L'!AB96","v":0},{"$f":"'2. P&L'!AC96","v":0},{"$f":"'2. P&L'!AD96","v":0},{"$f":"'2. P&L'!AE96","v":0},{"$f":"'2. P&L'!AF96","v":0},{"$f":"'2. P&L'!AG96","v":0},{"$f":"'2. P&L'!AH96","v":0},{"$f":"'2. P&L'!AI96","v":0},{"$f":"'2. P&L'!AJ96","v":0},{"$f":"'2. P&L'!AK96","v":0},{"$f":"'2. P&L'!AL96","v":0},{"$f":"'2. P&L'!AM96","v":0},{"$f":"'2. P&L'!AN96","v":0},{"$f":"'2. P&L'!AO96","v":0},{"$f":"'2. P&L'!AP96","v":0},{"$f":"'2. P&L'!AQ96","v":0},{"$f":"'2. P&L'!AR96","v":0},{"$f":"'2. P&L'!AS96","v":0},{"$f":"'2. P&L'!AT96","v":0},{"$f":"'2. P&L'!AU96","v":0},{"$f":"'2. P&L'!AV96","v":0},{"$f":"'2. P&L'!AW96","v":0},{"$f":"'2. P&L'!AX96","v":0},{"$f":"'2. P&L'!AY96","v":0},{"$f":"'2. P&L'!AZ96","v":0},{"$f":"'2. P&L'!BA96","v":0},{"$f":"'2. P&L'!BB96","v":0},{"$f":"'2. P&L'!BC96","v":0},{"$f":"'2. P&L'!BD96","v":0},{"$f":"'2. P&L'!BE96","v":0},{"$f":"'2. P&L'!BF96","v":0},{"$f":"'2. P&L'!BG96","v":0},{"$f":"'2. P&L'!BH96","v":0},{"$f":"'2. P&L'!BI96","v":0},{"$f":"'2. P&L'!BJ96","v":0},{"$f":"'2. P&L'!BK96","v":0},{"$f":"'2. P&L'!BL96","v":0},{"$f":"'2. P&L'!BM96","v":0},{"$f":"'2. P&L'!BN96","v":0},{"$f":"'2. P&L'!BO96","v":0},{"$f":"'2. P&L'!BP96","v":0},{"$f":"'2. P&L'!BQ96","v":0},{"$f":"'2. P&L'!BR96","v":0},{"$f":"'2. P&L'!BS96","v":0},{"$f":"'2. P&L'!BT96","v":0},{"$f":"'2. P&L'!BU96","v":0},{"$f":"'2. P&L'!BV96","v":0},{"$f":"'2. P&L'!BW96","v":0},{"$f":"'2. P&L'!BX96","v":0},{"$f":"'2. P&L'!BY96","v":0},{"$f":"'2. P&L'!BZ96","v":0},{"$f":"'2. P&L'!CA96","v":0},{"$f":"'2. P&L'!CB96","v":0}]
["Résultat net",null,null,null,null,{"$f":"'2. P&L'!F108","v":0},{"$f":"'2. P&L'!G108","v":0},{"$f":"'2. P&L'!H108","v":0},{"$f":"'2. P&L'!I108","v":0},{"$f":"'2. P&L'!J108","v":0},{"$f":"'2. P&L'!K108","v":0},{"$f":"'2. P&L'!L108","v":0},{"$f":"'2. P&L'!M108","v":0},{"$f":"'2. P&L'!N108","v":0},{"$f":"'2. P&L'!O108","v":0},{"$f":"'2. P&L'!P108","v":0},{"$f":"'2. P&L'!Q108","v":0},{"$f":"'2. P&L'!R108","v":0},{"$f":"'2. P&L'!S108","v":0},{"$f":"'2. P&L'!T108","v":0},{"$f":"'2. P&L'!U108","v":0},{"$f":"'2. P&L'!V108","v":0},{"$f":"'2. P&L'!W108","v":0},{"$f":"'2. P&L'!X108","v":0},{"$f":"'2. P&L'!Y108","v":0},{"$f":"'2. P&L'!Z108","v":0},{"$f":"'2. P&L'!AA108","v":0},{"$f":"'2. P&L'!AB108","v":0},{"$f":"'2. P&L'!AC108","v":0},{"$f":"'2. P&L'!AD108","v":0},{"$f":"'2. P&L'!AE108","v":0},{"$f":"'2. P&L'!AF108","v":0},{"$f":"'2. P&L'!AG108","v":0},{"$f":"'2. P&L'!AH108","v":0},{"$f":"'2. P&L'!AI108","v":0},{"$f":"'2. P&L'!AJ108","v":0},{"$f":"'2. P&L'!AK108","v":0},{"$f":"'2. P&L'!AL108","v":0},{"$f":"'2. P&L'!AM108","v":0},{"$f":"'2. P&L'!AN108","v":0},{"$f":"'2. P&L'!AO108","v":0},{"$f":"'2. P&L'!AP108","v":0},{"$f":"'2. P&L'!AQ108","v":0},{"$f":"'2. P&L'!AR108","v":0},{"$f":"'2. P&L'!AS108","v":0},{"$f":"'2. P&L'!AT108","v":0},{"$f":"'2. P&L'!AU108","v":0},{"$f":"'2. P&L'!AV108","v":0},{"$f":"'2. P&L'!AW108","v":0},{"$f":"'2. P&L'!AX108","v":0},{"$f":"'2. P&L'!AY108","v":0},{"$f":"'2. P&L'!AZ108","v":0},{"$f":"'2. P&L'!BA108","v":0},{"$f":"'2. P&L'!BB108","v":0},{"$f":"'2. P&L'!BC108","v":0},{"$f":"'2. P&L'!BD108","v":0},{"$f":"'2. P&L'!BE108","v":0},{"$f":"'2. P&L'!BF108","v":0},{"$f":"'2. P&L'!BG108","v":0},{"$f":"'2. P&L'!BH108","v":0},{"$f":"'2. P&L'!BI108","v":0},{"$f":"'2. P&L'!BJ108","v":0},{"$f":"'2. P&L'!BK108","v":0},{"$f":"'2. P&L'!BL108","v":0},{"$f":"'2. P&L'!BM108","v":0},{"$f":"'2. P&L'!BN108","v":0},{"$f":"'2. P&L'!BO108","v":0},{"$f":"'2. P&L'!BP108","v":0},{"$f":"'2. P&L'!BQ108","v":0},{"$f":"'2. P&L'!BR108","v":0},{"$f":"'2. P&L'!BS108","v":0},{"$f":"'2. P&L'!BT108","v":0},{"$f":"'2. P&L'!BU108","v":0},{"$f":"'2. P&L'!BV108","v":0},{"$f":"'2. P&L'!BW108","v":0},{"$f":"'2. P&L'!BX108","v":0},{"$f":"'2. P&L'!BY108","v":0},{"$f":"'2. P&L'!BZ108","v":0},{"$f":"'2. P&L'!CA108","v":0},{"$f":"'2. P&L'!CB108","v":0}]
["Capitaux Propres",null,null,null,null,{"$f":"F27","v":0},0,0,0,0,0,0,0,0,0,0,0,0,0,0,0,0,0,0,0,{"$f":"Z27","v":0},0,{"$f":"AB27","v":0},0,0,0,0,0,0,0,0,0,0,0,0,0,0,0,0,0,0,0,0,0,0,0,0,0,0,0,0,0,0,0,0,0,0,0,0,0,0,0,0,0,0,0,0,0,0,0,0,0,0,0,0]
["FFO",null,null,null,null,{"$f":"'3. CF'!F12","v":0},{"$f":"'3. CF'!G12","v":0},{"$f":"'3. CF'!H12","v":0},{"$f":"'3. CF'!I12","v":0},{"$f":"'3. CF'!J12","v":0},{"$f":"'3. CF'!K12","v":0},{"$f":"'3. CF'!L12","v":0},{"$f":"'3. CF'!M12","v":0},{"$f":"'3. CF'!N12","v":0},{"$f":"'3. CF'!O12","v":0},{"$f":"'3. CF'!P12","v":0},{"$f":"'3. CF'!Q12","v":0},{"$f":"'3. CF'!R12","v":0},{"$f":"'3. CF'!S12","v":0},{"$f":"'3. CF'!T12","v":0},{"$f":"'3. CF'!U12","v":0},{"$f":"'3. CF'!V12","v":0},{"$f":"'3. CF'!W12","v":0},{"$f":"'3. CF'!X12","v":0},{"$f":"'3. CF'!Y12","v":0},{"$f":"'3. CF'!Z12","v":0},{"$f":"'3. CF'!AA12","v":0},{"$f":"'3. CF'!AB12","v":0},{"$f":"'3. CF'!AC12","v":0},{"$f":"'3. CF'!AD12","v":0},{"$f":"'3. CF'!AE12","v":0},{"$f":"'3. CF'!AF12","v":0},{"$f":"'3. CF'!AG12","v":0},{"$f":"'3. CF'!AH12","v":0},{"$f":"'3. CF'!AI12","v":0},{"$f":"'3. CF'!AJ12","v":0},{"$f":"'3. CF'!AK12","v":0},{"$f":"'3. CF'!AL12","v":0},{"$f":"'3. CF'!AM12","v":0},{"$f":"'3. CF'!AN12","v":0},{"$f":"'3. CF'!AO12","v":0},{"$f":"'3. CF'!AP12","v":0},{"$f":"'3. CF'!AQ12","v":0},{"$f":"'3. CF'!AR12","v":0},{"$f":"'3. CF'!AS12","v":0},{"$f":"'3. CF'!AT12","v":0},{"$f":"'3. CF'!AU12","v":0},{"$f":"'3. CF'!AV12","v":0},{"$f":"'3. CF'!AW12","v":0},{"$f":"'3. CF'!AX12","v":0},{"$f":"'3. CF'!AY12","v":0},{"$f":"'3. CF'!AZ12","v":0},{"$f":"'3. CF'!BA12","v":0},{"$f":"'3. CF'!BB12","v":0},{"$f":"'3. CF'!BC12","v":0},{"$f":"'3. CF'!BD12","v":0},{"$f":"'3. CF'!BE12","v":0},{"$f":"'3. CF'!BF12","v":0},{"$f":"'3. CF'!BG12","v":0},{"$f":"'3. CF'!BH12","v":0},{"$f":"'3. CF'!BI12","v":0},{"$f":"'3. CF'!BJ12","v":0},{"$f":"'3. CF'!BK12","v":0},{"$f":"'3. CF'!BL12","v":0},{"$f":"'3. CF'!BM12","v":0},{"$f":"'3. CF'!BN12","v":0},{"$f":"'3. CF'!BO12","v":0},{"$f":"'3. CF'!BP12","v":0},{"$f":"'3. CF'!BQ12","v":0},{"$f":"'3. CF'!BR12","v":0},{"$f":"'3. CF'!BS12","v":0},{"$f":"'3. CF'!BT12","v":0},{"$f":"'3. CF'!BU12","v":0},{"$f":"'3. CF'!BV12","v":0},{"$f":"'3. CF'!BW12","v":0},{"$f":"'3. CF'!BX12","v":0},{"$f":"'3. CF'!BY12","v":0},{"$f":"'3. CF'!BZ12","v":0},{"$f":"'3. CF'!CA12","v":0},{"$f":"'3. CF'!CB12","v":0}]
["Cash Flow disponibles pour la dette",null,null,null,null,{"$f":"F110+'3. CF'!F13","v":0},{"$f":"G110+'3. CF'!G13","v":0},{"$f":"H110+'3. CF'!H13","v":0},{"$f":"I110+'3. CF'!I13","v":0},{"$f":"J110+'3. CF'!J13","v":0},{"$f":"K110+'3. CF'!K13","v":0},{"$f":"L110+'3. CF'!L13","v":0},{"$f":"M110+'3. CF'!M13","v":0},{"$f":"N110+'3. CF'!N13","v":0},{"$f":"O110+'3. CF'!O13","v":0},{"$f":"P110+'3. CF'!P13","v":0},{"$f":"Q110+'3. CF'!Q13","v":0},{"$f":"R110+'3. CF'!R13","v":0},{"$f":"S110+'3. CF'!S13","v":0},{"$f":"T110+'3. CF'!T13","v":0},{"$f":"U110+'3. CF'!U13","v":0},{"$f":"V110+'3. CF'!V13","v":0},{"$f":"W110+'3. CF'!W13","v":0},{"$f":"X110+'3. CF'!X13","v":0},{"$f":"Y110+'3. CF'!Y13","v":0},{"$f":"Z110+'3. CF'!Z13","v":0},{"$f":"AA110+'3. CF'!AA13","v":0},{"$f":"AB110+'3. CF'!AB13","v":0},{"$f":"AC110+'3. CF'!AC13","v":0},{"$f":"AD110+'3. CF'!AD13","v":0},{"$f":"AE110+'3. CF'!AE13","v":0},{"$f":"AF110+'3. CF'!AF13","v":0},{"$f":"AG110+'3. CF'!AG13","v":0},{"$f":"AH110+'3. CF'!AH13","v":0},{"$f":"AI110+'3. CF'!AI13","v":0},{"$f":"AJ110+'3. CF'!AJ13","v":0},{"$f":"AK110+'3. CF'!AK13","v":0},{"$f":"AL110+'3. CF'!AL13","v":0},{"$f":"AM110+'3. CF'!AM13","v":0},{"$f":"AN110+'3. CF'!AN13","v":0},{"$f":"AO110+'3. CF'!AO13","v":0},{"$f":"AP110+'3. CF'!AP13","v":0},{"$f":"AQ110+'3. CF'!AQ13","v":0},{"$f":"AR110+'3. CF'!AR13","v":0},{"$f":"AS110+'3. CF'!AS13","v":0},{"$f":"AT110+'3. CF'!AT13","v":0},{"$f":"AU110+'3. CF'!AU13","v":0},{"$f":"AV110+'3. CF'!AV13","v":0},{"$f":"AW110+'3. CF'!AW13","v":0},{"$f":"AX110+'3. CF'!AX13","v":0},{"$f":"AY110+'3. CF'!AY13","v":0},{"$f":"AZ110+'3. CF'!AZ13","v":0},{"$f":"BA110+'3. CF'!BA13","v":0},{"$f":"BB110+'3. CF'!BB13","v":0},{"$f":"BC110+'3. CF'!BC13","v":0},{"$f":"BD110+'3. CF'!BD13","v":0},{"$f":"BE110+'3. CF'!BE13","v":0},{"$f":"BF110+'3. CF'!BF13","v":0},{"$f":"BG110+'3. CF'!BG13","v":0},{"$f":"BH110+'3. CF'!BH13","v":0},{"$f":"BI110+'3. CF'!BI13","v":0},{"$f":"BJ110+'3. CF'!BJ13","v":0},{"$f":"BK110+'3. CF'!BK13","v":0},{"$f":"BL110+'3. CF'!BL13","v":0},{"$f":"BM110+'3. CF'!BM13","v":0},{"$f":"BN110+'3. CF'!BN13","v":0},{"$f":"BO110+'3. CF'!BO13","v":0},{"$f":"BP110+'3. CF'!BP13","v":0},{"$f":"BQ110+'3. CF'!BQ13","v":0},{"$f":"BR110+'3. CF'!BR13","v":0},{"$f":"BS110+'3. CF'!BS13","v":0},{"$f":"BT110+'3. CF'!BT13","v":0},{"$f":"BU110+'3. CF'!BU13","v":0},{"$f":"BV110+'3. CF'!BV13","v":0},{"$f":"BW110+'3. CF'!BW13","v":0},{"$f":"BX110+'3. CF'!BX13","v":0},{"$f":"BY110+'3. CF'!BY13","v":0},{"$f":"BZ110+'3. CF'!BZ13","v":0},{"$f":"CA110+'3. CF'!CA13","v":0},{"$f":"CB110+'3. CF'!CB13","v":0}]
["Investissements",null,null,null,null,{"$f":"-'3. CF'!F13","v":0},{"$f":"-'3. CF'!G13","v":0},{"$f":"-'3. CF'!H13","v":0},{"$f":"-'3. CF'!I13","v":0},{"$f":"-'3. CF'!J13","v":0},{"$f":"-'3. CF'!K13","v":0},{"$f":"-'3. CF'!L13","v":0},{"$f":"-'3. CF'!M13","v":0},{"$f":"-'3. CF'!N13","v":0},{"$f":"-'3. CF'!O13","v":0},{"$f":"-'3. CF'!P13","v":0},{"$f":"-'3. CF'!Q13","v":0},{"$f":"-'3. CF'!R13","v":0},{"$f":"-'3. CF'!S13","v":0},{"$f":"-'3. CF'!T13","v":0},{"$f":"-'3. CF'!U13","v":0},{"$f":"-'3. CF'!V13","v":0},{"$f":"-'3. CF'!W13","v":0},{"$f":"-'3. CF'!X13","v":0},{"$f":"-'3. CF'!Y13","v":0},{"$f":"-'3. CF'!Z13","v":0},{"$f":"-'3. CF'!AA13","v":0},{"$f":"-'3. CF'!AB13","v":0},{"$f":"-'3. CF'!AC13","v":0},{"$f":"-'3. CF'!AD13","v":0},{"$f":"-'3. CF'!AE13","v":0},{"$f":"-'3. CF'!AF13","v":0},{"$f":"-'3. CF'!AG13","v":0},{"$f":"-'3. CF'!AH13","v":0},{"$f":"-'3. CF'!AI13","v":0},{"$f":"-'3. CF'!AJ13","v":0},{"$f":"-'3. CF'!AK13","v":0},{"$f":"-'3. CF'!AL13","v":0},{"$f":"-'3. CF'!AM13","v":0},{"$f":"-'3. CF'!AN13","v":0},{"$f":"-'3. CF'!AO13","v":0},{"$f":"-'3. CF'!AP13","v":0},{"$f":"-'3. CF'!AQ13","v":0},{"$f":"-'3. CF'!AR13","v":0},{"$f":"-'3. CF'!AS13","v":0},{"$f":"-'3. CF'!AT13","v":0},{"$f":"-'3. CF'!AU13","v":0},{"$f":"-'3. CF'!AV13","v":0},{"$f":"-'3. CF'!AW13","v":0},{"$f":"-'3. CF'!AX13","v":0},{"$f":"-'3. CF'!AY13","v":0},{"$f":"-'3. CF'!AZ13","v":0},{"$f":"-'3. CF'!BA13","v":0},{"$f":"-'3. CF'!BB13","v":0},{"$f":"-'3. CF'!BC13","v":0},{"$f":"-'3. CF'!BD13","v":0},{"$f":"-'3. CF'!BE13","v":0},{"$f":"-'3. CF'!BF13","v":0},{"$f":"-'3. CF'!BG13","v":0},{"$f":"-'3. CF'!BH13","v":0},{"$f":"-'3. CF'!BI13","v":0},{"$f":"-'3. CF'!BJ13","v":0},{"$f":"-'3. CF'!BK13","v":0},{"$f":"-'3. CF'!BL13","v":0},{"$f":"-'3. CF'!BM13","v":0},{"$f":"-'3. CF'!BN13","v":0},{"$f":"-'3. CF'!BO13","v":0},{"$f":"-'3. CF'!BP13","v":0},{"$f":"-'3. CF'!BQ13","v":0},{"$f":"-'3. CF'!BR13","v":0},{"$f":"-'3. CF'!BS13","v":0},{"$f":"-'3. CF'!BT13","v":0},{"$f":"-'3. CF'!BU13","v":0},{"$f":"-'3. CF'!BV13","v":0},{"$f":"-'3. CF'!BW13","v":0},{"$f":"-'3. CF'!BX13","v":0},{"$f":"-'3. CF'!BY13","v":0},{"$f":"-'3. CF'!BZ13","v":0},{"$f":"-'3. CF'!CA13","v":0},{"$f":"-'3. CF'!CB13","v":0}]
[]
["Marge EBITDA",null,null,null,null,{"$f":"'2. P&L'!F77","v":""},{"$f":"'2. P&L'!G77","v":""},{"$f":"'2. P&L'!H77","v":""},{"$f":"'2. P&L'!I77","v":""},{"$f":"'2. P&L'!J77","v":""},{"$f":"'2. P&L'!K77","v":""},{"$f":"'2. P&L'!L77","v":""},{"$f":"'2. P&L'!M77","v":""},{"$f":"'2. P&L'!N77","v":""},{"$f":"'2. P&L'!O77","v":""},{"$f":"'2. P&L'!P77","v":""},{"$f":"'2. P&L'!Q77","v":""},{"$f":"'2. P&L'!R77","v":""},{"$f":"'2. P&L'!S77","v":""},{"$f":"'2. P&L'!T77","v":""},{"$f":"'2. P&L'!U77","v":""},{"$f":"'2. P&L'!V77","v":""},{"$f":"'2. P&L'!W77","v":""},{"$f":"'2. P&L'!X77","v":""},{"$f":"'2. P&L'!Y77","v":""},{"$f":"'2. P&L'!Z77","v":""},{"$f":"'2. P&L'!AA77","v":""},{"$f":"'2. P&L'!AB77","v":""},{"$f":"'2. P&L'!AC77","v":""},{"$f":"'2. P&L'!AD77","v":""},{"$f":"'2. P&L'!AE77","v":""},{"$f":"'2. P&L'!AF77","v":""},{"$f":"'2. P&L'!AG77","v":""},{"$f":"'2. P&L'!AH77","v":""},{"$f":"'2. P&L'!AI77","v":""},{"$f":"'2. P&L'!AJ77","v":""},{"$f":"'2. P&L'!AK77","v":""},{"$f":"'2. P&L'!AL77","v":""},{"$f":"'2. P&L'!AM77","v":""},{"$f":"'2. P&L'!AN77","v":""},{"$f":"'2. P&L'!AO77","v":""},{"$f":"'2. P&L'!AP77","v":""},{"$f":"'2. P&L'!AQ77","v":""},{"$f":"'2. P&L'!AR77","v":""},{"$f":"'2. P&L'!AS77","v":""},{"$f":"'2. P&L'!AT77","v":""},{"$f":"'2. P&L'!AU77","v":""},{"$f":"'2. P&L'!AV77","v":""},{"$f":"'2. P&L'!AW77","v":""},{"$f":"'2. P&L'!AX77","v":""},{"$f":"'2. P&L'!AY77","v":""},{"$f":"'2. P&L'!AZ77","v":""},{"$f":"'2. P&L'!BA77","v":""},{"$f":"'2. P&L'!BB77","v":""},{"$f":"'2. P&L'!BC77","v":""},{"$f":"'2. P&L'!BD77","v":""},{"$f":"'2. P&L'!BE77","v":""},{"$f":"'2. P&L'!BF77","v":""},{"$f":"'2. P&L'!BG77","v":""},{"$f":"'2. P&L'!BH77","v":""},{"$f":"'2. P&L'!BI77","v":""},{"$f":"'2. P&L'!BJ77","v":""},{"$f":"'2. P&L'!BK77","v":""},{"$f":"'2. P&L'!BL77","v":""},{"$f":"'2. P&L'!BM77","v":""},{"$f":"'2. P&L'!BN77","v":""},{"$f":"'2. P&L'!BO77","v":""},{"$f":"'2. P&L'!BP77","v":""},{"$f":"'2. P&L'!BQ77","v":""},{"$f":"'2. P&L'!BR77","v":""},{"$f":"'2. P&L'!BS77","v":""},{"$f":"'2. P&L'!BT77","v":""},{"$f":"'2. P&L'!BU77","v":""},{"$f":"'2. P&L'!BV77","v":""},{"$f":"'2. P&L'!BW77","v":""},{"$f":"'2. P&L'!BX77","v":""},{"$f":"'2. P&L'!BY77","v":""},{"$f":"'2. P&L'!BZ77","v":""},{"$f":"'2. P&L'!CA77","v":""},{"$f":"'2. P&L'!CB77","v":""}]
["Marge Nette",null,null,null,null,{"$f":"'2. P&L'!F109","v":""},{"$f":"'2. P&L'!G109","v":""},{"$f":"'2. P&L'!H109","v":""},{"$f":"'2. P&L'!I109","v":""},{"$f":"'2. P&L'!J109","v":""},{"$f":"'2. P&L'!K109","v":""},{"$f":"'2. P&L'!L109","v":""},{"$f":"'2. P&L'!M109","v":""},{"$f":"'2. P&L'!N109","v":""},{"$f":"'2. P&L'!O109","v":""},{"$f":"'2. P&L'!P109","v":""},{"$f":"'2. P&L'!Q109","v":""},{"$f":"'2. P&L'!R109","v":""},{"$f":"'2. P&L'!S109","v":""},{"$f":"'2. P&L'!T109","v":""},{"$f":"'2. P&L'!U109","v":""},{"$f":"'2. P&L'!V109","v":""},{"$f":"'2. P&L'!W109","v":""},{"$f":"'2. P&L'!X109","v":""},{"$f":"'2. P&L'!Y109","v":""},{"$f":"'2. P&L'!Z109","v":""},{"$f":"'2. P&L'!AA109","v":""},{"$f":"'2. P&L'!AB109","v":""},{"$f":"'2. P&L'!AC109","v":""},{"$f":"'2. P&L'!AD109","v":""},{"$f":"'2. P&L'!AE109","v":""},{"$f":"'2. P&L'!AF109","v":""},{"$f":"'2. P&L'!AG109","v":""},{"$f":"'2. P&L'!AH109","v":""},{"$f":"'2. P&L'!AI109","v":""},{"$f":"'2. P&L'!AJ109","v":""},{"$f":"'2. P&L'!AK109","v":""},{"$f":"'2. P&L'!AL109","v":""},{"$f":"'2. P&L'!AM109","v":""},{"$f":"'2. P&L'!AN109","v":""},{"$f":"'2. P&L'!AO109","v":""},{"$f":"'2. P&L'!AP109","v":""},{"$f":"'2. P&L'!AQ109","v":""},{"$f":"'2. P&L'!AR109","v":""},{"$f":"'2. P&L'!AS109","v":""},{"$f":"'2. P&L'!AT109","v":""},{"$f":"'2. P&L'!AU109","v":""},{"$f":"'2. P&L'!AV109","v":""},{"$f":"'2. P&L'!AW109","v":""},{"$f":"'2. P&L'!AX109","v":""},{"$f":"'2. P&L'!AY109","v":""},{"$f":"'2. P&L'!AZ109","v":""},{"$f":"'2. P&L'!BA109","v":""},{"$f":"'2. P&L'!BB109","v":""},{"$f":"'2. P&L'!BC109","v":""},{"$f":"'2. P&L'!BD109","v":""},{"$f":"'2. P&L'!BE109","v":""},{"$f":"'2. P&L'!BF109","v":""},{"$f":"'2. P&L'!BG109","v":""},{"$f":"'2. P&L'!BH109","v":""},{"$f":"'2. P&L'!BI109","v":""},{"$f":"'2. P&L'!BJ109","v":""},{"$f":"'2. P&L'!BK109","v":""},{"$f":"'2. P&L'!BL109","v":""},{"$f":"'2. P&L'!BM109","v":""},{"$f":"'2. P&L'!BN109","v":""},{"$f":"'2. P&L'!BO109","v":""},{"$f":"'2. P&L'!BP109","v":""},{"$f":"'2. P&L'!BQ109","v":""},{"$f":"'2. P&L'!BR109","v":""},{"$f":"'2. P&L'!BS109","v":""},{"$f":"'2. P&L'!BT109","v":""},{"$f":"'2. P&L'!BU109","v":""},{"$f":"'2. P&L'!BV109","v":""},{"$f":"'2. P&L'!BW109","v":""},{"$f":"'2. P&L'!BX109","v":""},{"$f":"'2. P&L'!BY109","v":""},{"$f":"'2. P&L'!BZ109","v":""},{"$f":"'2. P&L'!CA109","v":""},{"$f":"'2. P&L'!CB109","v":""}]
["EBITDA / Frais Financiers",null,null,null,null,{"$f":"IFERROR(F105/-F107,\"\")","v":""},{"$f":"IFERROR(G105/-G107,\"\")","v":""},{"$f":"IFERROR(H105/-H107,\"\")","v":""},{"$f":"IFERROR(I105/-I107,\"\")","v":""},{"$f":"IFERROR(J105/-J107,\"\")","v":""},"","","","","","","","","","","","","","","",{"$f":"IFERROR(Z105/-Z107,\"\")","v":""},"",{"$f":"IFERROR(AB105/-AB107,\"\")","v":""},"","","","","","","","","","","","","","","","","","","","","","","","","","","","","","","","","","","","","","","","","","","","","","","","","","","",""]
["Dette financière nette / EBITDA",null,null,null,null,{"$f":"IFERROR(F65/F105,\"\")","v":""},"","","","","","","","","","","","","","","","","","","",{"$f":"IFERROR(Z65/Z105,\"\")","v":""},"",{"$f":"IFERROR(AB65/AB105,\"\")","v":""},"","","","","","","","","","","","","","","","","","","","","","","","","","","","","","","","","","","","","","","","","","","","","","","","","","","",""]
["Dette financière nette / Capitaux Propres",null,null,null,null,{"$f":"IFERROR(F65/F109,\"\")","v":""},"","","","","","","","","","","","","","","","","","","",{"$f":"IFERROR(Z65/Z109,\"\")","v":""},"",{"$f":"IFERROR(AB65/AB109,\"\")","v":""},"","","","","","","","","","","","","","","","","","","","","","","","","","","","","","","","","","","","","","","","","","","","","","","","","","","",""]
["FFO / Dette financière",null,null,null,null,{"$f":"IFERROR(F110/F63,\"\")","v":""},{"$f":"IFERROR(G110/G63,\"\")","v":""},{"$f":"IFERROR(H110/H63,\"\")","v":""},{"$f":"IFERROR(I110/I63,\"\")","v":""},{"$f":"IFERROR(J110/J63,\"\")","v":""},"","","","","","","","","","","","","","","",{"$f":"IFERROR(Z110/Z63,\"\")","v":""},"",{"$f":"IFERROR(AB110/AB63,\"\")","v":""},"","","","","","","","","","","","","","","","","","","","","","","","","","","","","","","","","","","","","","","","","","","","","","","","","","","",""]
["LLCR",null,null,null,null,null,{"$f":"IFERROR(NPV('2. P&L'!F100,'4. Bilan & ratios'!I111:$AB$111)/G40,\"\")","v":""},{"$f":"IFERROR(NPV('2. P&L'!G100,'4. Bilan & ratios'!J111:$AB$111)/H40,\"\")","v":""},{"$f":"IFERROR(NPV('2. P&L'!H100,'4. Bilan & ratios'!J111:$AB$111)/I40,\"\")","v":""},{"$f":"IFERROR(NPV('2. P&L'!I100,'4. Bilan & ratios'!K111:$AB$111)/J40,\"\")","v":""},{"$f":"IFERROR(NPV('2. P&L'!J100,'4. Bilan & ratios'!L111:$AB$111)/K40,\"\")","v":""},{"$f":"IFERROR(NPV('2. P&L'!K100,'4. Bilan & ratios'!M111:$AB$111)/L40,\"\")","v":""},{"$f":"IFERROR(NPV('2. P&L'!L100,'4. Bilan & ratios'!N111:$AB$111)/M40,\"\")","v":""},{"$f":"IFERROR(NPV('2. P&L'!M100,'4. Bilan & ratios'!O111:$AB$111)/N40,\"\")","v":""},{"$f":"IFERROR(NPV('2. P&L'!N100,'4. Bilan & ratios'!P111:$AB$111)/O40,\"\")","v":""},{"$f":"IFERROR(NPV('2. P&L'!O100,'4. Bilan & ratios'!Q111:$AB$111)/P40,\"\")","v":""},{"$f":"IFERROR(NPV('2. P&L'!P100,'4. Bilan & ratios'!R111:$AB$111)/Q40,\"\")","v":""},{"$f":"IFERROR(NPV('2. P&L'!Q100,'4. Bilan & ratios'!S111:$AB$111)/R40,\"\")","v":""},{"$f":"IFERROR(NPV('2. P&L'!R100,'4. Bilan & ratios'!T111:$AB$111)/S40,\"\")","v":""},{"$f":"IFERROR(NPV('2. P&L'!S100,'4. Bilan & ratios'!U111:$AB$111)/T40,\"\")","v":""},{"$f":"IFERROR(NPV('2. P&L'!T100,'4. Bilan & ratios'!V111:$AB$111)/U40,\"\")","v":""},{"$f":"IFERROR(NPV('2. P&L'!U100,'4. Bilan & ratios'!W111:$AB$111)/V40,\"\")","v":""},{"$f":"IFERROR(NPV('2. P&L'!V100,'4. Bilan & ratios'!X111:$AB$111)/W40,\"\")","v":""},{"$f":"IFERROR(NPV('2. P&L'!W100,'4. Bilan & ratios'!Y111:$AB$111)/X40,\"\")","v":""},{"$f":"IFERROR(NPV('2. P&L'!X100,'4. Bilan & ratios'!Z111:$AB$111)/Y40,\"\")","v":""},{"$f":"IFERROR(NPV('2. P&L'!Y100,'4. Bilan & ratios'!AA111:$AB$111)/Z40,\"\")","v":""},{"$f":"IFERROR(NPV('2. P&L'!Z100,'4. Bilan & ratios'!AB111:$AB$111)/AA40,\"\")","v":""},{"$f":"IFERROR(NPV('2. P&L'!AA100,'4. Bilan & ratios'!$AB111:AC$111)/AB40,\"\")","v":""},{"$f":"IFERROR(NPV('2. P&L'!AB100,'4. Bilan & ratios'!$AB111:AD$111)/AC40,\"\")","v":""},{"$f":"IFERROR(NPV('2. P&L'!AC100,'4. Bilan & ratios'!$AB111:AE$111)/AD40,\"\")","v":""},{"$f":"IFERROR(NPV('2. P&L'!AD100,'4. Bilan & ratios'!$AB111:AF$111)/AE40,\"\")","v":""},{"$f":"IFERROR(NPV('2. P&L'!AE100,'4. Bilan & ratios'!$AB111:AG$111)/AF40,\"\")","v":""},{"$f":"IFERROR(NPV('2. P&L'!AF100,'4. Bilan & ratios'!$AB111:AH$111)/AG40,\"\")","v":""},{"$f":"IFERROR(NPV('2. P&L'!AG100,'4. Bilan & ratios'!$AB111:AI$111)/AH40,\"\")","v":""},{"$f":"IFERROR(NPV('2. P&L'!AH100,'4. Bilan & ratios'!$AB111:AJ$111)/AI40,\"\")","v":""},{"$f":"IFERROR(NPV('2. P&L'!AI100,'4. Bilan & ratios'!$AB111:AK$111)/AJ40,\"\")","v":""},{"$f":"IFERROR(NPV('2. P&L'!AJ100,'4. Bilan & ratios'!$AB111:AL$111)/AK40,\"\")","v":""},{"$f":"IFERROR(NPV('2. P&L'!AK100,'4. Bilan & ratios'!$AB111:AM$111)/AL40,\"\")","v":""},{"$f":"IFERROR(NPV('2. P&L'!AL100,'4. Bilan & ratios'!$AB111:AN$111)/AM40,\"\")","v":""},{"$f":"IFERROR(NPV('2. P&L'!AM100,'4. Bilan & ratios'!$AB111:AO$111)/AN40,\"\")","v":""},{"$f":"IFERROR(NPV('2. P&L'!AN100,'4. Bilan & ratios'!$AB111:AP$111)/AO40,\"\")","v":""},{"$f":"IFERROR(NPV('2. P&L'!AO100,'4. Bilan & ratios'!$AB111:AQ$111)/AP40,\"\")","v":""},{"$f":"IFERROR(NPV('2. P&L'!AP100,'4. Bilan & ratios'!$AB111:AR$111)/AQ40,\"\")","v":""},{"$f":"IFERROR(NPV('2. P&L'!AQ100,'4. Bilan & ratios'!$AB111:AS$111)/AR40,\"\")","v":""},{"$f":"IFERROR(NPV('2. P&L'!AR100,'4. Bilan & ratios'!$AB111:AT$111)/AS40,\"\")","v":""},{"$f":"IFERROR(NPV('2. P&L'!AS100,'4. Bilan & ratios'!$AB111:AU$111)/AT40,\"\")","v":""},{"$f":"IFERROR(NPV('2. P&L'!AT100,'4. Bilan & ratios'!$AB111:AV$111)/AU40,\"\")","v":""},{"$f":"IFERROR(NPV('2. P&L'!AU100,'4. Bilan & ratios'!$AB111:AW$111)/AV40,\"\")","v":""},{"$f":"IFERROR(NPV('2. P&L'!AV100,'4. Bilan & ratios'!$AB111:AX$111)/AW40,\"\")","v":""},{"$f":"IFERROR(NPV('2. P&L'!AW100,'4. Bilan & ratios'!$AB111:AY$111)/AX40,\"\")","v":""},{"$f":"IFERROR(NPV('2. P&L'!AX100,'4. Bilan & ratios'!$AB111:AZ$111)/AY40,\"\")","v":""},{"$f":"IFERROR(NPV('2. P&L'!AY100,'4. Bilan & ratios'!$AB111:BA$111)/AZ40,\"\")","v":""},{"$f":"IFERROR(NPV('2. P&L'!AZ100,'4. Bilan & ratios'!$AB111:BB$111)/BA40,\"\")","v":""},{"$f":"IFERROR(NPV('2. P&L'!BA100,'4. Bilan & ratios'!$AB111:BC$111)/BB40,\"\")","v":""},{"$f":"IFERROR(NPV('2. P&L'!BB100,'4. Bilan & ratios'!$AB111:BD$111)/BC40,\"\")","v":""},{"$f":"IFERROR(NPV('2. P&L'!BC100,'4. Bilan & ratios'!$AB111:BE$111)/BD40,\"\")","v":""},{"$f":"IFERROR(NPV('2. P&L'!BD100,'4. Bilan & ratios'!$AB111:BF$111)/BE40,\"\")","v":""},{"$f":"IFERROR(NPV('2. P&L'!BE100,'4. Bilan & ratios'!$AB111:BG$111)/BF40,\"\")","v":""},{"$f":"IFERROR(NPV('2. P&L'!BF100,'4. Bilan & ratios'!$AB111:BH$111)/BG40,\"\")","v":""},{"$f":"IFERROR(NPV('2. P&L'!BG100,'4. Bilan & ratios'!$AB111:BI$111)/BH40,\"\")","v":""},{"$f":"IFERROR(NPV('2. P&L'!BH100,'4. Bilan & ratios'!$AB111:BJ$111)/BI40,\"\")","v":""},{"$f":"IFERROR(NPV('2. P&L'!BI100,'4. Bilan & ratios'!$AB111:BK$111)/BJ40,\"\")","v":""},{"$f":"IFERROR(NPV('2. P&L'!BJ100,'4. Bilan & ratios'!$AB111:BL$111)/BK40,\"\")","v":""},{"$f":"IFERROR(NPV('2. P&L'!BK100,'4. Bilan & ratios'!$AB111:BM$111)/BL40,\"\")","v":""},{"$f":"IFERROR(NPV('2. P&L'!BL100,'4. Bilan & ratios'!$AB111:BN$111)/BM40,\"\")","v":""},{"$f":"IFERROR(NPV('2. P&L'!BM100,'4. Bilan & ratios'!$AB111:BO$111)/BN40,\"\")","v":""},{"$f":"IFERROR(NPV('2. P&L'!BN100,'4. Bilan & ratios'!$AB111:BP$111)/BO40,\"\")","v":""},{"$f":"IFERROR(NPV('2. P&L'!BO100,'4. Bilan & ratios'!$AB111:BQ$111)/BP40,\"\")","v":""},{"$f":"IFERROR(NPV('2. P&L'!BP100,'4. Bilan & ratios'!$AB111:BR$111)/BQ40,\"\")","v":""},{"$f":"IFERROR(NPV('2. P&L'!BQ100,'4. Bilan & ratios'!$AB111:BS$111)/BR40,\"\")","v":""},{"$f":"IFERROR(NPV('2. P&L'!BR100,'4. Bilan & ratios'!$AB111:BT$111)/BS40,\"\")","v":""},{"$f":"IFERROR(NPV('2. P&L'!BS100,'4. Bilan & ratios'!$AB111:BU$111)/BT40,\"\")","v":""},{"$f":"IFERROR(NPV('2. P&L'!BT100,'4. Bilan & ratios'!$AB111:BV$111)/BU40,\"\")","v":""},{"$f":"IFERROR(NPV('2. P&L'!BU100,'4. Bilan & ratios'!$AB111:BW$111)/BV40,\"\")","v":""},{"$f":"IFERROR(NPV('2. P&L'!BV100,'4. Bilan & ratios'!$AB111:BX$111)/BW40,\"\")","v":""},{"$f":"IFERROR(NPV('2. P&L'!BW100,'4. Bilan & ratios'!$AB111:BY$111)/BX40,\"\")","v":""},{"$f":"IFERROR(NPV('2. P&L'!BX100,'4. Bilan & ratios'!$AB111:BZ$111)/BY40,\"\")","v":""},{"$f":"IFERROR(NPV('2. P&L'!BY100,'4. Bilan & ratios'!$AB111:CA$111)/BZ40,\"\")","v":""},{"$f":"IFERROR(NPV('2. P&L'!BZ100,'4. Bilan & ratios'!$AB111:CB$111)/CA40,\"\")","v":""},{"$f":"IFERROR(NPV('2. P&L'!CA100,'4. Bilan & ratios'!$AB111:CC$111)/CB40,\"\")","v":""}]
["ROCE",null,null,null,null,{"$f":"IFERROR((F106*(1-'2. P&L'!F111))/F61,\"\")","v":""},{"$f":"IFERROR((G106*(1-'2. P&L'!G111))/G61,\"\")","v":""},{"$f":"IFERROR((H106*(1-'2. P&L'!H111))/H61,\"\")","v":""},{"$f":"IFERROR((I106*(1-'2. P&L'!I111))/I61,\"\")","v":""},{"$f":"IFERROR((J106*(1-'2. P&L'!J111))/J61,\"\")","v":""},{"$f":"IFERROR((K106*(1-'2. P&L'!K111))/K61,\"\")","v":""},{"$f":"IFERROR((L106*(1-'2. P&L'!L111))/L61,\"\")","v":""},{"$f":"IFERROR((M106*(1-'2. P&L'!M111))/M61,\"\")","v":""},{"$f":"IFERROR((N106*(1-'2. P&L'!N111))/N61,\"\")","v":""},{"$f":"IFERROR((O106*(1-'2. P&L'!O111))/O61,\"\")","v":""},{"$f":"IFERROR((P106*(1-'2. P&L'!P111))/P61,\"\")","v":""},{"$f":"IFERROR((Q106*(1-'2. P&L'!Q111))/Q61,\"\")","v":""},{"$f":"IFERROR((R106*(1-'2. P&L'!R111))/R61,\"\")","v":""},{"$f":"IFERROR((S106*(1-'2. P&L'!S111))/S61,\"\")","v":""},{"$f":"IFERROR((T106*(1-'2. P&L'!T111))/T61,\"\")","v":""},{"$f":"IFERROR((U106*(1-'2. P&L'!U111))/U61,\"\")","v":""},{"$f":"IFERROR((V106*(1-'2. P&L'!V111))/V61,\"\")","v":""},{"$f":"IFERROR((W106*(1-'2. P&L'!W111))/W61,\"\")","v":""},{"$f":"IFERROR((X106*(1-'2. P&L'!X111))/X61,\"\")","v":""},{"$f":"IFERROR((Y106*(1-'2. P&L'!Y111))/Y61,\"\")","v":""},{"$f":"IFERROR((Z106*(1-'2. P&L'!Z111))/Z61,\"\")","v":""},{"$f":"IFERROR((AA106*(1-'2. P&L'!AA111))/AA61,\"\")","v":""},{"$f":"IFERROR((AB106*(1-'2. P&L'!AB111))/AB61,\"\")","v":""},{"$f":"IFERROR((AC106*(1-'2. P&L'!AC111))/AC61,\"\")","v":""},{"$f":"IFERROR((AD106*(1-'2. P&L'!AD111))/AD61,\"\")","v":""},{"$f":"IFERROR((AE106*(1-'2. P&L'!AE111))/AE61,\"\")","v":""},{"$f":"IFERROR((AF106*(1-'2. P&L'!AF111))/AF61,\"\")","v":""},{"$f":"IFERROR((AG106*(1-'2. P&L'!AG111))/AG61,\"\")","v":""},{"$f":"IFERROR((AH106*(1-'2. P&L'!AH111))/AH61,\"\")","v":""},{"$f":"IFERROR((AI106*(1-'2. P&L'!AI111))/AI61,\"\")","v":""},{"$f":"IFERROR((AJ106*(1-'2. P&L'!AJ111))/AJ61,\"\")","v":""},{"$f":"IFERROR((AK106*(1-'2. P&L'!AK111))/AK61,\"\")","v":""},{"$f":"IFERROR((AL106*(1-'2. P&L'!AL111))/AL61,\"\")","v":""},{"$f":"IFERROR((AM106*(1-'2. P&L'!AM111))/AM61,\"\")","v":""},{"$f":"IFERROR((AN106*(1-'2. P&L'!AN111))/AN61,\"\")","v":""},{"$f":"IFERROR((AO106*(1-'2. P&L'!AO111))/AO61,\"\")","v":""},{"$f":"IFERROR((AP106*(1-'2. P&L'!AP111))/AP61,\"\")","v":""},{"$f":"IFERROR((AQ106*(1-'2. P&L'!AQ111))/AQ61,\"\")","v":""},{"$f":"IFERROR((AR106*(1-'2. P&L'!AR111))/AR61,\"\")","v":""},{"$f":"IFERROR((AS106*(1-'2. P&L'!AS111))/AS61,\"\")","v":""},{"$f":"IFERROR((AT106*(1-'2. P&L'!AT111))/AT61,\"\")","v":""},{"$f":"IFERROR((AU106*(1-'2. P&L'!AU111))/AU61,\"\")","v":""},{"$f":"IFERROR((AV106*(1-'2. P&L'!AV111))/AV61,\"\")","v":""},{"$f":"IFERROR((AW106*(1-'2. P&L'!AW111))/AW61,\"\")","v":""},{"$f":"IFERROR((AX106*(1-'2. P&L'!AX111))/AX61,\"\")","v":""},{"$f":"IFERROR((AY106*(1-'2. P&L'!AY111))/AY61,\"\")","v":""},{"$f":"IFERROR((AZ106*(1-'2. P&L'!AZ111))/AZ61,\"\")","v":""},{"$f":"IFERROR((BA106*(1-'2. P&L'!BA111))/BA61,\"\")","v":""},{"$f":"IFERROR((BB106*(1-'2. P&L'!BB111))/BB61,\"\")","v":""},{"$f":"IFERROR((BC106*(1-'2. P&L'!BC111))/BC61,\"\")","v":""},{"$f":"IFERROR((BD106*(1-'2. P&L'!BD111))/BD61,\"\")","v":""},{"$f":"IFERROR((BE106*(1-'2. P&L'!BE111))/BE61,\"\")","v":""},{"$f":"IFERROR((BF106*(1-'2. P&L'!BF111))/BF61,\"\")","v":""},{"$f":"IFERROR((BG106*(1-'2. P&L'!BG111))/BG61,\"\")","v":""},{"$f":"IFERROR((BH106*(1-'2. P&L'!BH111))/BH61,\"\")","v":""},{"$f":"IFERROR((BI106*(1-'2. P&L'!BI111))/BI61,\"\")","v":""},{"$f":"IFERROR((BJ106*(1-'2. P&L'!BJ111))/BJ61,\"\")","v":""},{"$f":"IFERROR((BK106*(1-'2. P&L'!BK111))/BK61,\"\")","v":""},{"$f":"IFERROR((BL106*(1-'2. P&L'!BL111))/BL61,\"\")","v":""},{"$f":"IFERROR((BM106*(1-'2. P&L'!BM111))/BM61,\"\")","v":""},{"$f":"IFERROR((BN106*(1-'2. P&L'!BN111))/BN61,\"\")","v":""},{"$f":"IFERROR((BO106*(1-'2. P&L'!BO111))/BO61,\"\")","v":""},{"$f":"IFERROR((BP106*(1-'2. P&L'!BP111))/BP61,\"\")","v":""},{"$f":"IFERROR((BQ106*(1-'2. P&L'!BQ111))/BQ61,\"\")","v":""},{"$f":"IFERROR((BR106*(1-'2. P&L'!BR111))/BR61,\"\")","v":""},{"$f":"IFERROR((BS106*(1-'2. P&L'!BS111))/BS61,\"\")","v":""},{"$f":"IFERROR((BT106*(1-'2. P&L'!BT111))/BT61,\"\")","v":""},{"$f":"IFERROR((BU106*(1-'2. P&L'!BU111))/BU61,\"\")","v":""},{"$f":"IFERROR((BV106*(1-'2. P&L'!BV111))/BV61,\"\")","v":""},{"$f":"IFERROR((BW106*(1-'2. P&L'!BW111))/BW61,\"\")","v":""},{"$f":"IFERROR((BX106*(1-'2. P&L'!BX111))/BX61,\"\")","v":""},{"$f":"IFERROR((BY106*(1-'2. P&L'!BY111))/BY61,\"\")","v":""},{"$f":"IFERROR((BZ106*(1-'2. P&L'!BZ111))/BZ61,\"\")","v":""},{"$f":"IFERROR((CA106*(1-'2. P&L'!CA111))/CA61,\"\")","v":""},{"$f":"IFERROR((CB106*(1-'2. P&L'!CB111))/CB61,\"\")","v":""}]
["FFO / investissements",null,null,null,null,{"$f":"IFERROR(F110/F112,\"\")","v":""},"","","","","","","","","","","","","","","","","","","",{"$f":"IFERROR(Z110/Z112,\"\")","v":""},"",{"$f":"IFERROR(AB110/AB112,\"\")","v":""},"","","","","","","","","","","","","","","","","","","","","","","","","","","","","","","","","","","","","","","","","","","","","","","","","","","",""]

{"sheet":"5. Investissements","index":5,"n_rows":96,"n_cols":80,"rows_kept":96,"cut":false,"hidden":false,"merged":[[1,0,1,27],[3,0,3,27],[85,0,85,27]]}
[{"$f":"'1. Info'!$D$5","v":0}]
["Programme Investissements"]
[]
[" Investissements de développement"]
["( en M€ courants)  ","Aide à la saisie","Commentaires SCA","Total période","Cumul < 2015","2015 (p)","2015 (r)","2016 (p)","2016 (r)","2017 (p)","2018 (p)","2019 (p)","2020 (p)","2021 (p)","2022 (p)","2023 (p)","2024 (p)","2025 (p)","2026 (p)","2027 (p)","2028 (p)","2029 (p)","2030 (p)","2031 (p)","2032 (p)","2033 (p)","2034 (p)","2035 (p)","2036 (p)","2037 (p)","2038 (p)","2039 (p)","2040 (p)","2041 (p)","2042 (p)","2043 (p)","2044 (p)","2045 (p)","2046 (p)","2047 (p)","2048 (p)","2049 (p)","2050 (p)","2051 (p)","2052 (p)","2053 (p)","2054 (p)","2055 (p)","2056 (p)","2057 (p)","2058 (p)","2059 (p)","2060 (p)","2061 (p)","2062 (p)","2063 (p)","2064 (p)","2065 (p)","2066 (p)","2067 (p)","2068 (p)","2069 (p)","2070 (p)","2071 (p)","2072 (p)","2073 (p)","2074 (p)","2075 (p)","2076 (p)","2077 (p)","2078 (p)","2079 (p)","2080 (p)","2081 (p)","2082 (p)","2083 (p)","2084 (p)","2085 (p)","2086 (p)","2087 (p)"]
[]
["Opérations prévues au cahier des charges (autres que celles détaillées ci-dessous)","Données comptables pour les exercices passés et données prévisionnelles pour les exercices futurs.\nLe cumul <2015 ne concerne que les projets actifs à la date de l'étude et dont les premières dépenses ont eu lieu avant 2015.",null,{"$f":"SUM(D8:D14)","v":0},{"$f":"SUM(E8:E14)","v":0},{"$f":"SUM(F8:F14)","v":0},{"$f":"SUM(G8:G14)","v":0},0,0,0,0,0,0,0,0,0,0,0,0,0,0,0,0,0,0,{"$f":"SUM(Z8:Z14)","v":0},{"$f":"SUM(AA8:AA14)","v":0},{"$f":"SUM(AB8:AB14)","v":0},{"$f":"SUM(AC8:AC14)","v":0},{"$f":"SUM(AD8:AD14)","v":0},{"$f":"SUM(AE8:AE14)","v":0},{"$f":"SUM(AF8:AF14)","v":0},{"$f":"SUM(AG8:AG14)","v":0},{"$f":"SUM(AH8:AH14)","v":0},{"$f":"SUM(AI8:AI14)","v":0},{"$f":"SUM(AJ8:AJ14)","v":0},{"$f":"SUM(AK8:AK14)","v":0},{"$f":"SUM(AL8:AL14)","v":0},{"$f":"SUM(AM8:AM14)","v":0},{"$f":"SUM(AN8:AN14)","v":0},{"$f":"SUM(AO8:AO14)","v":0},{"$f":"SUM(AP8:AP14)","v":0},{"$f":"SUM(AQ8:AQ14)","v":0},{"$f":"SUM(AR8:AR14)","v":0},{"$f":"SUM(AS8:AS14)","v":0},{"$f":"SUM(AT8:AT14)","v":0},{"$f":"SUM(AU8:AU14)","v":0},{"$f":"SUM(AV8:AV14)","v":0},{"$f":"SUM(AW8:AW14)","v":0},{"$f":"SUM(AX8:AX14)","v":0},{"$f":"SUM(AY8:AY14)","v":0},{"$f":"SUM(AZ8:AZ14)","v":0},{"$f":"SUM(BA8:BA14)","v":0},{"$f":"SUM(BB8:BB14)","v":0},{"$f":"SUM(BC8:BC14)","v":0},{"$f":"SUM(BD8:BD14)","v":0},{"$f":"SUM(BE8:BE14)","v":0},{"$f":"SUM(BF8:BF14)","v":0},{"$f":"SUM(BG8:BG14)","v":0},{"$f":"SUM(BH8:BH14)","v":0},{"$f":"SUM(BI8:BI14)","v":0},{"$f":"SUM(BJ8:BJ14)","v":0},{"$f":"SUM(BK8:BK14)","v":0},{"$f":"SUM(BL8:BL14)","v":0},{"$f":"SUM(BM8:BM14)","v":0},{"$f":"SUM(BN8:BN14)","v":0},{"$f":"SUM(BO8:BO14)","v":0},{"$f":"SUM(BP8:BP14)","v":0},{"$f":"SUM(BQ8:BQ14)","v":0},{"$f":"SUM(BR8:BR14)","v":0},{"$f":"SUM(BS8:BS14)","v":0},{"$f":"SUM(BT8:BT14)","v":0},{"$f":"SUM(BU8:BU14)","v":0},{"$f":"SUM(BV8:BV14)","v":0},{"$f":"SUM(BW8:BW14)","v":0},{"$f":"SUM(BX8:BX14)","v":0},{"$f":"SUM(BY8:BY14)","v":0},{"$f":"SUM(BZ8:BZ14)","v":0},{"$f":"SUM(CA8:CA14)","v":0},{"$f":"SUM(CB8:CB14)","v":0}]
["- Nouvelle section AXX",null,null,{"$f":"SUM(I8:AB8)+G8+E8","v":0}]
["- Elargissement section Y - Z",null,null,0]
["…",null,null,0]
[null,null,null,0]
[null,null,null,0]
[null,null,null,0]
[null,null,null,0]
[]
[]
[" Contrats de plan","Données comptables pour les exercices passés et données prévisionnelles pour les exercices futurs.\nLe cumul <2015 ne concerne que les projets actifs à la date de l'étude et dont les premières dépenses ont eu lieu avant 2015.",null,{"$f":"SUM(D18:D37)","v":0},{"$f":"SUM(E18:E37)","v":0},{"$f":"SUM(F18:F37)","v":0},{"$f":"SUM(G18:G37)","v":0},0,0,0,0,0,0,0,0,0,0,0,0,0,0,0,0,0,0,{"$f":"SUM(Z18:Z37)","v":0},{"$f":"SUM(AA18:AA37)","v":0},{"$f":"SUM(AB18:AB37)","v":0},{"$f":"SUM(AC18:AC37)","v":0},{"$f":"SUM(AD18:AD37)","v":0},{"$f":"SUM(AE18:AE37)","v":0},{"$f":"SUM(AF18:AF37)","v":0},{"$f":"SUM(AG18:AG37)","v":0},{"$f":"SUM(AH18:AH37)","v":0},{"$f":"SUM(AI18:AI37)","v":0},{"$f":"SUM(AJ18:AJ37)","v":0},{"$f":"SUM(AK18:AK37)","v":0},{"$f":"SUM(AL18:AL37)","v":0},{"$f":"SUM(AM18:AM37)","v":0},{"$f":"SUM(AN18:AN37)","v":0},{"$f":"SUM(AO18:AO37)","v":0},{"$f":"SUM(AP18:AP37)","v":0},{"$f":"SUM(AQ18:AQ37)","v":0},{"$f":"SUM(AR18:AR37)","v":0},{"$f":"SUM(AS18:AS37)","v":0},{"$f":"SUM(AT18:AT37)","v":0},{"$f":"SUM(AU18:AU37)","v":0},{"$f":"SUM(AV18:AV37)","v":0},{"$f":"SUM(AW18:AW37)","v":0},{"$f":"SUM(AX18:AX37)","v":0},{"$f":"SUM(AY18:AY37)","v":0},{"$f":"SUM(AZ18:AZ37)","v":0},{"$f":"SUM(BA18:BA37)","v":0},{"$f":"SUM(BB18:BB37)","v":0},{"$f":"SUM(BC18:BC37)","v":0},{"$f":"SUM(BD18:BD37)","v":0},{"$f":"SUM(BE18:BE37)","v":0},{"$f":"SUM(BF18:BF37)","v":0},{"$f":"SUM(BG18:BG37)","v":0},{"$f":"SUM(BH18:BH37)","v":0},{"$f":"SUM(BI18:BI37)","v":0},{"$f":"SUM(BJ18:BJ37)","v":0},{"$f":"SUM(BK18:BK37)","v":0},{"$f":"SUM(BL18:BL37)","v":0},{"$f":"SUM(BM18:BM37)","v":0},{"$f":"SUM(BN18:BN37)","v":0},{"$f":"SUM(BO18:BO37)","v":0},{"$f":"SUM(BP18:BP37)","v":0},{"$f":"SUM(BQ18:BQ37)","v":0},{"$f":"SUM(BR18:BR37)","v":0},{"$f":"SUM(BS18:BS37)","v":0},{"$f":"SUM(BT18:BT37)","v":0},{"$f":"SUM(BU18:BU37)","v":0},{"$f":"SUM(BV18:BV37)","v":0},{"$f":"SUM(BW18:BW37)","v":0},{"$f":"SUM(BX18:BX37)","v":0},{"$f":"SUM(BY18:BY37)","v":0},{"$f":"SUM(BZ18:BZ37)","v":0},{"$f":"SUM(CA18:CA37)","v":0},{"$f":"SUM(CB18:CB37)","v":0}]
["- Opération 1",null,null,{"$f":"SUM(I18:AB18)+G18+E18","v":0}]
["- Opération 2",null,null,0]
["- Opération 3",null,null,0]
["…",null,null,0]
[null,null,null,0]
[null,null,null,0]
[null,null,null,0]
[null,null,null,{"$f":"SUM(I25:AB25)+G25+E25","v":0}]
[null,null,null,0]
[null,null,null,0]
[null,null,null,0]
[null,null,null,0]
[null,null,null,0]
[null,null,null,0]
[null,null,null,0]
[null,null,null,0]
[null,null,null,0]
[null,null,null,0]
[null,null,null,0]
[null,null,null,0]
[]
[]
["Plan de relance","Données comptables pour les exercices passée et données prévisionnelles pour les exercices futurs.\nLe cumul <2015 ne concnerne que les projets actifs à la date de l'étude et dont les premières dépenses ont eu lieu avant 2015.",null,{"$f":"SUM(D41:D60)","v":0},{"$f":"SUM(E41:E60)","v":0},{"$f":"SUM(F41:F60)","v":0},{"$f":"SUM(G41:G60)","v":0},{"$f":"SUM(H41:H60)","v":0},0,0,0,0,0,0,0,0,0,0,0,0,0,0,0,0,0,{"$f":"SUM(Z41:Z60)","v":0},{"$f":"SUM(AA41:AA60)","v":0},{"$f":"SUM(AB41:AB60)","v":0},{"$f":"SUM(AC41:AC60)","v":0},{"$f":"SUM(AD41:AD60)","v":0},{"$f":"SUM(AE41:AE60)","v":0},{"$f":"SUM(AF41:AF60)","v":0},{"$f":"SUM(AG41:AG60)","v":0},{"$f":"SUM(AH41:AH60)","v":0},{"$f":"SUM(AI41:AI60)","v":0},{"$f":"SUM(AJ41:AJ60)","v":0},{"$f":"SUM(AK41:AK60)","v":0},{"$f":"SUM(AL41:AL60)","v":0},{"$f":"SUM(AM41:AM60)","v":0},{"$f":"SUM(AN41:AN60)","v":0},{"$f":"SUM(AO41:AO60)","v":0},{"$f":"SUM(AP41:AP60)","v":0},{"$f":"SUM(AQ41:AQ60)","v":0},{"$f":"SUM(AR41:AR60)","v":0},{"$f":"SUM(AS41:AS60)","v":0},{"$f":"SUM(AT41:AT60)","v":0},{"$f":"SUM(AU41:AU60)","v":0},{"$f":"SUM(AV41:AV60)","v":0},{"$f":"SUM(AW41:AW60)","v":0},{"$f":"SUM(AX41:AX60)","v":0},{"$f":"SUM(AY41:AY60)","v":0},{"$f":"SUM(AZ41:AZ60)","v":0},{"$f":"SUM(BA41:BA60)","v":0},{"$f":"SUM(BB41:BB60)","v":0},{"$f":"SUM(BC41:BC60)","v":0},{"$f":"SUM(BD41:BD60)","v":0},{"$f":"SUM(BE41:BE60)","v":0},{"$f":"SUM(BF41:BF60)","v":0},{"$f":"SUM(BG41:BG60)","v":0},{"$f":"SUM(BH41:BH60)","v":0},{"$f":"SUM(BI41:BI60)","v":0},{"$f":"SUM(BJ41:BJ60)","v":0},{"$f":"SUM(BK41:BK60)","v":0},{"$f":"SUM(BL41:BL60)","v":0},{"$f":"SUM(BM41:BM60)","v":0},{"$f":"SUM(BN41:BN60)","v":0},{"$f":"SUM(BO41:BO60)","v":0},{"$f":"SUM(BP41:BP60)","v":0},{"$f":"SUM(BQ41:BQ60)","v":0},{"$f":"SUM(BR41:BR60)","v":0},{"$f":"SUM(BS41:BS60)","v":0},{"$f":"SUM(BT41:BT60)","v":0},{"$f":"SUM(BU41:BU60)","v":0},{"$f":"SUM(BV41:BV60)","v":0},{"$f":"SUM(BW41:BW60)","v":0},{"$f":"SUM(BX41:BX60)","v":0},{"$f":"SUM(BY41:BY60)","v":0},{"$f":"SUM(BZ41:BZ60)","v":0},{"$f":"SUM(CA41:CA60)","v":0},{"$f":"SUM(CB41:CB60)","v":0}]
["- Opération 1",null,null,{"$f":"SUM(I41:AB41)+G41+E41","v":0}]
["- Opération 2",null,null,0]
["- Opération 3",null,null,0]
["- Opération 4",null,null,0]
["- Opération 5",null,null,0]
["…",null,null,0]
[null,null,null,0]
[null,null,null,0]
[null,null,null,0]
[null,null,null,0]
[null,null,null,0]
[null,null,null,0]
[null,null,null,0]
[null,null,null,0]
[null,null,null,0]
[null,null,null,0]
[null,null,null,0]
[null,null,null,0]
[null,null,null,0]
[null,null,null,0]
[]
[]
["Plan d'Investissement Autoroutier (PIA)","Données comptables pour les exercices passés et données prévisionnelles pour les exercices futurs.\nLe cumul <2015 ne concerne que les projets actifs à la date de l'étude et dont les premières dépenses ont eu lieu avant 2015.",null,{"$f":"SUM(D64:D83)","v":0},{"$f":"SUM(E64:E83)","v":0},{"$f":"SUM(F64:F83)","v":0},{"$f":"SUM(G64:G83)","v":0},0,0,0,0,0,0,0,0,0,0,0,0,0,0,0,0,0,0,{"$f":"SUM(Z64:Z83)","v":0},{"$f":"SUM(AA64:AA83)","v":0},{"$f":"SUM(AB64:AB83)","v":0},{"$f":"SUM(AC64:AC83)","v":0},{"$f":"SUM(AD64:AD83)","v":0},{"$f":"SUM(AE64:AE83)","v":0},{"$f":"SUM(AF64:AF83)","v":0},{"$f":"SUM(AG64:AG83)","v":0},{"$f":"SUM(AH64:AH83)","v":0},{"$f":"SUM(AI64:AI83)","v":0},{"$f":"SUM(AJ64:AJ83)","v":0},{"$f":"SUM(AK64:AK83)","v":0},{"$f":"SUM(AL64:AL83)","v":0},{"$f":"SUM(AM64:AM83)","v":0},{"$f":"SUM(AN64:AN83)","v":0},{"$f":"SUM(AO64:AO83)","v":0},{"$f":"SUM(AP64:AP83)","v":0},{"$f":"SUM(AQ64:AQ83)","v":0},{"$f":"SUM(AR64:AR83)","v":0},{"$f":"SUM(AS64:AS83)","v":0},{"$f":"SUM(AT64:AT83)","v":0},{"$f":"SUM(AU64:AU83)","v":0},{"$f":"SUM(AV64:AV83)","v":0},{"$f":"SUM(AW64:AW83)","v":0},{"$f":"SUM(AX64:AX83)","v":0},{"$f":"SUM(AY64:AY83)","v":0},{"$f":"SUM(AZ64:AZ83)","v":0},{"$f":"SUM(BA64:BA83)","v":0},{"$f":"SUM(BB64:BB83)","v":0},{"$f":"SUM(BC64:BC83)","v":0},{"$f":"SUM(BD64:BD83)","v":0},{"$f":"SUM(BE64:BE83)","v":0},{"$f":"SUM(BF64:BF83)","v":0},{"$f":"SUM(BG64:BG83)","v":0},{"$f":"SUM(BH64:BH83)","v":0},{"$f":"SUM(BI64:BI83)","v":0},{"$f":"SUM(BJ64:BJ83)","v":0},{"$f":"SUM(BK64:BK83)","v":0},{"$f":"SUM(BL64:BL83)","v":0},{"$f":"SUM(BM64:BM83)","v":0},{"$f":"SUM(BN64:BN83)","v":0},{"$f":"SUM(BO64:BO83)","v":0},{"$f":"SUM(BP64:BP83)","v":0},{"$f":"SUM(BQ64:BQ83)","v":0},{"$f":"SUM(BR64:BR83)","v":0},{"$f":"SUM(BS64:BS83)","v":0},{"$f":"SUM(BT64:BT83)","v":0},{"$f":"SUM(BU64:BU83)","v":0},{"$f":"SUM(BV64:BV83)","v":0},{"$f":"SUM(BW64:BW83)","v":0},{"$f":"SUM(BX64:BX83)","v":0},{"$f":"SUM(BY64:BY83)","v":0},{"$f":"SUM(BZ64:BZ83)","v":0},{"$f":"SUM(CA64:CA83)","v":0},{"$f":"SUM(CB64:CB83)","v":0}]
["- Opération 1",null,null,{"$f":"SUM(I64:AB64)+G64+E64","v":0}]
["- Opération 2",null,null,{"$f":"SUM(I65:AB65)+G65+E65","v":0}]
["…",null,null,{"$f":"SUM(I66:AB66)+G66+E66","v":0}]
[null,null,null,{"$f":"SUM(I67:AB67)+G67+E67","v":0}]
[null,null,null,0]
[null,null,null,0]
[null,null,null,0]
[null,null,null,0]
[null,null,null,0]
[null,null,null,0]
[null,null,null,0]
[null,null,null,0]
[null,null,null,0]
[null,null,null,0]
[null,null,null,0]
[null,null,null,0]
[null,null,null,0]
[null,null,null,0]
[null,null,null,0]
[null,null,null,0]
[]
[]
[" Investissements de renouvellement ou de maintenance"]
["( en M€ courants)  ","Aide à la saisie","Commentaires SCA","Total période",null,"2015 (p)","2015 (r)","2016 (p)","2016 (r)","2017 (p)","2018 (p)","2019 (p)","2020 (p)","2021 (p)","2022 (p)","2023 (p)","2024 (p)","2025 (p)","2026 (p)","2027 (p)","2028 (p)","2029 (p)","2030 (p)","2031 (p)","2032 (p)","2033 (p)","2034 (p)","2035 (p)","2036 (p)","2037 (p)","2038 (p)","2039 (p)","2040 (p)","2041 (p)","2042 (p)","2043 (p)","2044 (p)","2045 (p)","2046 (p)","2047 (p)","2048 (p)","2049 (p)","2050 (p)","2051 (p)","2052 (p)","2053 (p)","2054 (p)","2055 (p)","2056 (p)","2057 (p)","2058 (p)","2059 (p)","2060 (p)","2061 (p)","2062 (p)","2063 (p)","2064 (p)","2065 (p)","2066 (p)","2067 (p)","2068 (p)","2069 (p)","2070 (p)","2071 (p)","2072 (p)","2073 (p)","2074 (p)","2075 (p)","2076 (p)","2077 (p)","2078 (p)","2079 (p)","2080 (p)","2081 (p)","2082 (p)","2083 (p)","2084 (p)","2085 (p)","2086 (p)","2087 (p)"]
[]
["Travaux d'entretien/renouvellement immobilisés","Vision analytique des investissements. \nAu-delà de la 5ème année, vision agrégée demandée.\nDonnées comptables pour les exercices passée et données prévisionnelles pour les exercices futurs",null,{"$f":"SUM(I89:AB89)+G89","v":0},null,{"$f":"SUM(F90:F93)","v":0},0,0,0,0,0,0,0,0]
["Chaussées","Couches structurelles et couches de roulement pour les sociétés qui les immobilisent"]
["Ouvrages d'art"]
["Tunnels"]
["Autres investissements de maintenance"]
[]
["( en M€ courants)  ","Aide à la saisie","Commentaires SCA","Total période",null,"2015 (p)","2015 (r)","2016 (p)","2016 (r)","2017 (p)","2018 (p)","2019 (p)","2020 (p)","2021 (p)","2022 (p)","2023 (p)","2024 (p)","2025 (p)","2026 (p)","2027 (p)","2028 (p)","2029 (p)","2030 (p)","2031 (p)","2032 (p)","2033 (p)","2034 (p)","2035 (p)","2036 (p)","2037 (p)","2038 (p)","2039 (p)","2040 (p)","2041 (p)","2042 (p)","2043 (p)","2044 (p)","2045 (p)","2046 (p)","2047 (p)","2048 (p)","2049 (p)","2050 (p)","2051 (p)","2052 (p)","2053 (p)","2054 (p)","2055 (p)","2056 (p)","2057 (p)","2058 (p)","2059 (p)","2060 (p)","2061 (p)","2062 (p)","2063 (p)","2064 (p)","2065 (p)","2066 (p)","2067 (p)","2068 (p)","2069 (p)","2070 (p)","2071 (p)","2072 (p)","2073 (p)","2074 (p)","2075 (p)","2076 (p)","2077 (p)","2078 (p)","2079 (p)","2080 (p)","2081 (p)","2082 (p)","2083 (p)","2084 (p)","2085 (p)","2086 (p)","2087 (p)"]
["Total Investissements",null,null,{"$f":"SUM(I96:AB96)+G96","v":0},null,{"$f":"+F7+F17+F40+F63+F89","v":0},0,0,0,0,0,0,0,0,0,0,0,0,0,0,0,0,0,0,0,{"$f":"+Z7+Z17+Z40+Z63+Z89","v":0},0,0,0,0,0,0,0,0,0,0,0,0,0,0,0,0,0,0,0,0,0,0,0,0,0,0,0,0,0,0,0,0,0,0,0,0,0,0,0,0,0,0,0,0,0,0,0,0,0,0,0,0,0,0]

{"sheet":"6. Dette","index":6,"n_rows":54,"n_cols":23,"rows_kept":54,"cut":false,"hidden":false,"merged":[[51,0,51,10],[23,0,23,6],[1,0,1,15],[34,0,34,10]]}
[{"$f":"'1. Info'!$D$5","v":0},null,null,null,null,null,null,null,null,null,null,null,null,null,null,"Date"]
["Détail Dette externe"]
[]
["Libellé","Type de Dette","Nominal","Type de taux","Taux de Référence","Spread","Taux Intérêt","Date Échéance","Profil de Remboursement","Reste à rembourser","Covenants ou autres contraintes à définir","Emprunt Swappé","Montant de l'emprunt swappé","Référence du Swap","Taux d'intérêt après Swap","Remarques",null,null,null,"Obligataire","In fine","Fixe","oui"]
[null,null,null,null,null,null,null,null,null,null,null,null,null,null,null,null,null,null,null,"Bancaire","Linéaire","Variable","non"]
[null,null,null,null,null,null,null,null,null,null,null,null,null,null,null,null,null,null,null,"Mezzanine","Progressif"]
[null,null,null,null,null,null,null,null,null,null,null,null,null,null,null,null,null,null,null,"Actionnaires","Autre à préciser en remarques"]
[null,null,null,null,null,null,null,null,null,null,null,null,null,null,null,null,null,null,null,"RCF"]
[null,null,null,null,null,null,null,null,null,null,null,null,null,null,null,null,null,null,null,"Découvert"]
[null,null,null,null,null,null,null,null,null,null,null,null,null,null,null,null,null,null,null,"Autre à préciser en remarques"]
[]
[]
[]
[]
[]
[]
[]
[]
[]
[]
[]
[]
[]
["Contrats de swaps"]
[]
["Référence du Swap","Emprunt concerné","Notionnel","Taux Payeur","Taux receveur","Date Échéance","Remarques"]
[]
[]
[]
[]
[]
[]
[]
[]
["Détail Dette intra-groupe"]
[]
["Libellé","Contrepartie","Nominal","Type de taux","Taux de Référence","Spread","Taux Intérêt","Date Échéance","Profil de Remboursement","Reste à rembourser","Remarques"]
[]
[]
[]
[]
[]
[]
[]
[]
[]
[]
[]
[]
[]
[]
["Détail créances intra-groupe"]
[]
["Libellé","Contrepartie","Nominal","Type de taux","Taux de Référence","Spread","Taux Intérêt","Date Échéance","Profil de Remboursement","Reste à rembourser","Remarques"]

{"sheet":"7. Graphes","index":7,"n_rows":0,"n_cols":0,"rows_kept":0,"cut":false,"hidden":false,"merged":[]}

{"sheet":"8. Données Graphes (ARAFER)","index":8,"n_rows":22,"n_cols":80,"rows_kept":22,"cut":false,"hidden":true,"merged":[]}
[]
["( en M€ courants)  ",null,null,null,null,"2015 (p)","2015 (r)","2016 (p)","2016 (r)","2017 (p)","2018 (p)","2019 (p)","2020 (p)","2021 (p)","2022 (p)","2023 (p)","2024 (p)","2025 (p)","2026 (p)","2027 (p)","2028 (p)","2029 (p)","2030 (p)","2031 (p)","2032 (p)","2033 (p)","2034 (p)","2035 (p)","2036 (p)","2037 (p)","2038 (p)","2039 (p)","2040 (p)","2041 (p)","2042 (p)","2043 (p)","2044 (p)","2045 (p)","2046 (p)","2047 (p)","2048 (p)","2049 (p)","2050 (p)","2051 (p)","2052 (p)","2053 (p)","2054 (p)","2055 (p)","2056 (p)","2057 (p)","2058 (p)","2059 (p)","2060 (p)","2061 (p)","2062 (p)","2063 (p)","2064 (p)","2065 (p)","2066 (p)","2067 (p)","2068 (p)","2069 (p)","2070 (p)","2071 (p)","2072 (p)","2073 (p)","2074 (p)","2075 (p)","2076 (p)","2077 (p)","2078 (p)","2079 (p)","2080 (p)","2081 (p)","2082 (p)","2083 (p)","2084 (p)","2085 (p)","2086 (p)","2087 (p)"]
[]
[]
["CA Péage",null,null,null,null,{"$f":"'2. P&L'!F33","v":0},{"$f":"'2. P&L'!G33","v":0},{"$f":"'2. P&L'!H33","v":0},{"$f":"'2. P&L'!I33","v":0},{"$f":"'2. P&L'!J33","v":0},{"$f":"'2. P&L'!K33","v":0},{"$f":"'2. P&L'!L33","v":0},{"$f":"'2. P&L'!M33","v":0},{"$f":"'2. P&L'!N33","v":0},{"$f":"'2. P&L'!O33","v":0},{"$f":"'2. P&L'!P33","v":0},{"$f":"'2. P&L'!Q33","v":0},{"$f":"'2. P&L'!R33","v":0},{"$f":"'2. P&L'!S33","v":0},{"$f":"'2. P&L'!T33","v":0},{"$f":"'2. P&L'!U33","v":0},{"$f":"'2. P&L'!V33","v":0},{"$f":"'2. P&L'!W33","v":0},{"$f":"'2. P&L'!X33","v":0},{"$f":"'2. P&L'!Y33","v":0},{"$f":"'2. P&L'!Z33","v":0},{"$f":"'2. P&L'!AA33","v":0},{"$f":"'2. P&L'!AB33","v":0},{"$f":"'2. P&L'!AC33","v":0},{"$f":"'2. P&L'!AD33","v":0},{"$f":"'2. P&L'!AE33","v":0},{"$f":"'2. P&L'!AF33","v":0},{"$f":"'2. P&L'!AG33","v":0},{"$f":"'2. P&L'!AH33","v":0},{"$f":"'2. P&L'!AI33","v":0},{"$f":"'2. P&L'!AJ33","v":0},{"$f":"'2. P&L'!AK33","v":0},{"$f":"'2. P&L'!AL33","v":0},{"$f":"'2. P&L'!AM33","v":0},{"$f":"'2. P&L'!AN33","v":0},{"$f":"'2. P&L'!AO33","v":0},{"$f":"'2. P&L'!AP33","v":0},{"$f":"'2. P&L'!AQ33","v":0},{"$f":"'2. P&L'!AR33","v":0},{"$f":"'2. P&L'!AS33","v":0},{"$f":"'2. P&L'!AT33","v":0},{"$f":"'2. P&L'!AU33","v":0},{"$f":"'2. P&L'!AV33","v":0},{"$f":"'2. P&L'!AW33","v":0},{"$f":"'2. P&L'!AX33","v":0},{"$f":"'2. P&L'!AY33","v":0},{"$f":"'2. P&L'!AZ33","v":0},{"$f":"'2. P&L'!BA33","v":0},{"$f":"'2. P&L'!BB33","v":0},{"$f":"'2. P&L'!BC33","v":0},{"$f":"'2. P&L'!BD33","v":0},{"$f":"'2. P&L'!BE33","v":0},{"$f":"'2. P&L'!BF33","v":0},{"$f":"'2. P&L'!BG33","v":0},{"$f":"'2. P&L'!BH33","v":0},{"$f":"'2. P&L'!BI33","v":0},{"$f":"'2. P&L'!BJ33","v":0},{"$f":"'2. P&L'!BK33","v":0},{"$f":"'2. P&L'!BL33","v":0},{"$f":"'2. P&L'!BM33","v":0},{"$f":"'2. P&L'!BN33","v":0},{"$f":"'2. P&L'!BO33","v":0},{"$f":"'2. P&L'!BP33","v":0},{"$f":"'2. P&L'!BQ33","v":0},{"$f":"'2. P&L'!BR33","v":0},{"$f":"'2. P&L'!BS33","v":0},{"$f":"'2. P&L'!BT33","v":0},{"$f":"'2. P&L'!BU33","v":0},{"$f":"'2. P&L'!BV33","v":0},{"$f":"'2. P&L'!BW33","v":0},{"$f":"'2. P&L'!BX33","v":0},{"$f":"'2. P&L'!BY33","v":0},{"$f":"'2. P&L'!BZ33","v":0},{"$f":"'2. P&L'!CA33","v":0},{"$f":"'2. P&L'!CB33","v":0}]
["Autre CA",null,null,null,null,{"$f":"F7-F5","v":0},0,0,0,0,0,0,0,0,0,0,0,0,0,0,0,0,0,0,0,{"$f":"Z7-Z5","v":0},0,0,{"$f":"AC7-AC5","v":0},0,0,0,0,0,0,0,{"$f":"AK7-AK5","v":0},0,0,0,0,0,0,0,0,0,0,0,0,0,0,0,0,0,0,0,0,0,0,0,0,0,0,0,0,0,0,0,0,0,0,0,0,0,0,0,0,0,0,0]
["CA Total",null,null,null,null,{"$f":"'2. P&L'!F32","v":0},{"$f":"'2. P&L'!G32","v":0},{"$f":"'2. P&L'!H32","v":0},{"$f":"'2. P&L'!I32","v":0},{"$f":"'2. P&L'!J32","v":0},{"$f":"'2. P&L'!K32","v":0},{"$f":"'2. P&L'!L32","v":0},{"$f":"'2. P&L'!M32","v":0},{"$f":"'2. P&L'!N32","v":0},{"$f":"'2. P&L'!O32","v":0},{"$f":"'2. P&L'!P32","v":0},{"$f":"'2. P&L'!Q32","v":0},{"$f":"'2. P&L'!R32","v":0},{"$f":"'2. P&L'!S32","v":0},{"$f":"'2. P&L'!T32","v":0},{"$f":"'2. P&L'!U32","v":0},{"$f":"'2. P&L'!V32","v":0},{"$f":"'2. P&L'!W32","v":0},{"$f":"'2. P&L'!X32","v":0},{"$f":"'2. P&L'!Y32","v":0},{"$f":"'2. P&L'!Z32","v":0},{"$f":"'2. P&L'!AA32","v":0},{"$f":"'2. P&L'!AB32","v":0},{"$f":"'2. P&L'!AC32","v":0},{"$f":"'2. P&L'!AD32","v":0},{"$f":"'2. P&L'!AE32","v":0},{"$f":"'2. P&L'!AF32","v":0},{"$f":"'2. P&L'!AG32","v":0},{"$f":"'2. P&L'!AH32","v":0},{"$f":"'2. P&L'!AI32","v":0},{"$f":"'2. P&L'!AJ32","v":0},{"$f":"'2. P&L'!AK32","v":0},{"$f":"'2. P&L'!AL32","v":0},{"$f":"'2. P&L'!AM32","v":0},{"$f":"'2. P&L'!AN32","v":0},{"$f":"'2. P&L'!AO32","v":0},{"$f":"'2. P&L'!AP32","v":0},{"$f":"'2. P&L'!AQ32","v":0},{"$f":"'2. P&L'!AR32","v":0},{"$f":"'2. P&L'!AS32","v":0},{"$f":"'2. P&L'!AT32","v":0},{"$f":"'2. P&L'!AU32","v":0},{"$f":"'2. P&L'!AV32","v":0},{"$f":"'2. P&L'!AW32","v":0},{"$f":"'2. P&L'!AX32","v":0},{"$f":"'2. P&L'!AY32","v":0},{"$f":"'2. P&L'!AZ32","v":0},{"$f":"'2. P&L'!BA32","v":0},{"$f":"'2. P&L'!BB32","v":0},{"$f":"'2. P&L'!BC32","v":0},{"$f":"'2. P&L'!BD32","v":0},{"$f":"'2. P&L'!BE32","v":0},{"$f":"'2. P&L'!BF32","v":0},{"$f":"'2. P&L'!BG32","v":0},{"$f":"'2. P&L'!BH32","v":0},{"$f":"'2. P&L'!BI32","v":0},{"$f":"'2. P&L'!BJ32","v":0},{"$f":"'2. P&L'!BK32","v":0},{"$f":"'2. P&L'!BL32","v":0},{"$f":"'2. P&L'!BM32","v":0},{"$f":"'2. P&L'!BN32","v":0},{"$f":"'2. P&L'!BO32","v":0},{"$f":"'2. P&L'!BP32","v":0},{"$f":"'2. P&L'!BQ32","v":0},{"$f":"'2. P&L'!BR32","v":0},{"$f":"'2. P&L'!BS32","v":0},{"$f":"'2. P&L'!BT32","v":0},{"$f":"'2. P&L'!BU32","v":0},{"$f":"'2. P&L'!BV32","v":0},{"$f":"'2. P&L'!BW32","v":0},{"$f":"'2. P&L'!BX32","v":0},{"$f":"'2. P&L'!BY32","v":0},{"$f":"'2. P&L'!BZ32","v":0},{"$f":"'2. P&L'!CA32","v":0},{"$f":"'2. P&L'!CB32","v":0}]
[]
["Ebitda",null,null,null,null,{"$f":"'2. P&L'!F76","v":0},{"$f":"'2. P&L'!G76","v":0},{"$f":"'2. P&L'!H76","v":0},{"$f":"'2. P&L'!I76","v":0},{"$f":"'2. P&L'!J76","v":0},{"$f":"'2. P&L'!K76","v":0},{"$f":"'2. P&L'!L76","v":0},{"$f":"'2. P&L'!M76","v":0},{"$f":"'2. P&L'!N76","v":0},{"$f":"'2. P&L'!O76","v":0},{"$f":"'2. P&L'!P76","v":0},{"$f":"'2. P&L'!Q76","v":0},{"$f":"'2. P&L'!R76","v":0},{"$f":"'2. P&L'!S76","v":0},{"$f":"'2. P&L'!T76","v":0},{"$f":"'2. P&L'!U76","v":0},{"$f":"'2. P&L'!V76","v":0},{"$f":"'2. P&L'!W76","v":0},{"$f":"'2. P&L'!X76","v":0},{"$f":"'2. P&L'!Y76","v":0},{"$f":"'2. P&L'!Z76","v":0},{"$f":"'2. P&L'!AA76","v":0},{"$f":"'2. P&L'!AB76","v":0},{"$f":"'2. P&L'!AC76","v":0},{"$f":"'2. P&L'!AD76","v":0},{"$f":"'2. P&L'!AE76","v":0},{"$f":"'2. P&L'!AF76","v":0},{"$f":"'2. P&L'!AG76","v":0},{"$f":"'2. P&L'!AH76","v":0},{"$f":"'2. P&L'!AI76","v":0},{"$f":"'2. P&L'!AJ76","v":0},{"$f":"'2. P&L'!AK76","v":0},{"$f":"'2. P&L'!AL76","v":0},{"$f":"'2. P&L'!AM76","v":0},{"$f":"'2. P&L'!AN76","v":0},{"$f":"'2. P&L'!AO76","v":0},{"$f":"'2. P&L'!AP76","v":0},{"$f":"'2. P&L'!AQ76","v":0},{"$f":"'2. P&L'!AR76","v":0},{"$f":"'2. P&L'!AS76","v":0},{"$f":"'2. P&L'!AT76","v":0},{"$f":"'2. P&L'!AU76","v":0},{"$f":"'2. P&L'!AV76","v":0},{"$f":"'2. P&L'!AW76","v":0},{"$f":"'2. P&L'!AX76","v":0},{"$f":"'2. P&L'!AY76","v":0},{"$f":"'2. P&L'!AZ76","v":0},{"$f":"'2. P&L'!BA76","v":0},{"$f":"'2. P&L'!BB76","v":0},{"$f":"'2. P&L'!BC76","v":0},{"$f":"'2. P&L'!BD76","v":0},{"$f":"'2. P&L'!BE76","v":0},{"$f":"'2. P&L'!BF76","v":0},{"$f":"'2. P&L'!BG76","v":0},{"$f":"'2. P&L'!BH76","v":0},{"$f":"'2. P&L'!BI76","v":0},{"$f":"'2. P&L'!BJ76","v":0},{"$f":"'2. P&L'!BK76","v":0},{"$f":"'2. P&L'!BL76","v":0},{"$f":"'2. P&L'!BM76","v":0},{"$f":"'2. P&L'!BN76","v":0},{"$f":"'2. P&L'!BO76","v":0},{"$f":"'2. P&L'!BP76","v":0},{"$f":"'2. P&L'!BQ76","v":0},{"$f":"'2. P&L'!BR76","v":0},{"$f":"'2. P&L'!BS76","v":0},{"$f":"'2. P&L'!BT76","v":0},{"$f":"'2. P&L'!BU76","v":0},{"$f":"'2. P&L'!BV76","v":0},{"$f":"'2. P&L'!BW76","v":0},{"$f":"'2. P&L'!BX76","v":0},{"$f":"'2. P&L'!BY76","v":0},{"$f":"'2. P&L'!BZ76","v":0},{"$f":"'2. P&L'!CA76","v":0},{"$f":"'2. P&L'!CB76","v":0}]
["Ebitda Margin",null,null,null,null,{"$f":"'2. P&L'!F77","v":""},{"$f":"'2. P&L'!G77","v":""},{"$f":"'2. P&L'!H77","v":""},{"$f":"'2. P&L'!I77","v":""},{"$f":"'2. P&L'!J77","v":""},{"$f":"'2. P&L'!K77","v":""},{"$f":"'2. P&L'!L77","v":""},{"$f":"'2. P&L'!M77","v":""},{"$f":"'2. P&L'!N77","v":""},{"$f":"'2. P&L'!O77","v":""},{"$f":"'2. P&L'!P77","v":""},{"$f":"'2. P&L'!Q77","v":""},{"$f":"'2. P&L'!R77","v":""},{"$f":"'2. P&L'!S77","v":""},{"$f":"'2. P&L'!T77","v":""},{"$f":"'2. P&L'!U77","v":""},{"$f":"'2. P&L'!V77","v":""},{"$f":"'2. P&L'!W77","v":""},{"$f":"'2. P&L'!X77","v":""},{"$f":"'2. P&L'!Y77","v":""},{"$f":"'2. P&L'!Z77","v":""},{"$f":"'2. P&L'!AA77","v":""},{"$f":"'2. P&L'!AB77","v":""},{"$f":"'2. P&L'!AC77","v":""},{"$f":"'2. P&L'!AD77","v":""},{"$f":"'2. P&L'!AE77","v":""},{"$f":"'2. P&L'!AF77","v":""},{"$f":"'2. P&L'!AG77","v":""},{"$f":"'2. P&L'!AH77","v":""},{"$f":"'2. P&L'!AI77","v":""},{"$f":"'2. P&L'!AJ77","v":""},{"$f":"'2. P&L'!AK77","v":""},{"$f":"'2. P&L'!AL77","v":""},{"$f":"'2. P&L'!AM77","v":""},{"$f":"'2. P&L'!AN77","v":""},{"$f":"'2. P&L'!AO77","v":""},{"$f":"'2. P&L'!AP77","v":""},{"$f":"'2. P&L'!AQ77","v":""},{"$f":"'2. P&L'!AR77","v":""},{"$f":"'2. P&L'!AS77","v":""},{"$f":"'2. P&L'!AT77","v":""},{"$f":"'2. P&L'!AU77","v":""},{"$f":"'2. P&L'!AV77","v":""},{"$f":"'2. P&L'!AW77","v":""},{"$f":"'2. P&L'!AX77","v":""},{"$f":"'2. P&L'!AY77","v":""},{"$f":"'2. P&L'!AZ77","v":""},{"$f":"'2. P&L'!BA77","v":""},{"$f":"'2. P&L'!BB77","v":""},{"$f":"'2. P&L'!BC77","v":""},{"$f":"'2. P&L'!BD77","v":""},{"$f":"'2. P&L'!BE77","v":""},{"$f":"'2. P&L'!BF77","v":""},{"$f":"'2. P&L'!BG77","v":""},{"$f":"'2. P&L'!BH77","v":""},{"$f":"'2. P&L'!BI77","v":""},{"$f":"'2. P&L'!BJ77","v":""},{"$f":"'2. P&L'!BK77","v":""},{"$f":"'2. P&L'!BL77","v":""},{"$f":"'2. P&L'!BM77","v":""},{"$f":"'2. P&L'!BN77","v":""},{"$f":"'2. P&L'!BO77","v":""},{"$f":"'2. P&L'!BP77","v":""},{"$f":"'2. P&L'!BQ77","v":""},{"$f":"'2. P&L'!BR77","v":""},{"$f":"'2. P&L'!BS77","v":""},{"$f":"'2. P&L'!BT77","v":""},{"$f":"'2. P&L'!BU77","v":""},{"$f":"'2. P&L'!BV77","v":""},{"$f":"'2. P&L'!BW77","v":""},{"$f":"'2. P&L'!BX77","v":""},{"$f":"'2. P&L'!BY77","v":""},{"$f":"'2. P&L'!BZ77","v":""},{"$f":"'2. P&L'!CA77","v":""},{"$f":"'2. P&L'!CB77","v":""}]
[]
["Capex Développement",null,null,null,null,{"$f":"'5. Investissements'!F7+'5. Investissements'!F17+'5. Investissements'!F40+'5. Investissements'!F63","v":0},{"$f":"'5. Investissements'!G7+'5. Investissements'!G17+'5. Investissements'!G40+'5. Investissements'!G63","v":0},{"$f":"'5. Investissements'!H7+'5. Investissements'!H17+'5. Investissements'!H40+'5. Investissements'!H63","v":0},{"$f":"'5. Investissements'!I7+'5. Investissements'!I17+'5. Investissements'!I40+'5. Investissements'!I63","v":0},{"$f":"'5. Investissements'!J7+'5. Investissements'!J17+'5. Investissements'!J40+'5. Investissements'!J63","v":0},{"$f":"'5. Investissements'!K7+'5. Investissements'!K17+'5. Investissements'!K40+'5. Investissements'!K63","v":0},{"$f":"'5. Investissements'!L7+'5. Investissements'!L17+'5. Investissements'!L40+'5. Investissements'!L63","v":0},{"$f":"'5. Investissements'!M7+'5. Investissements'!M17+'5. Investissements'!M40+'5. Investissements'!M63","v":0},{"$f":"'5. Investissements'!N7+'5. Investissements'!N17+'5. Investissements'!N40+'5. Investissements'!N63","v":0},{"$f":"'5. Investissements'!O7+'5. Investissements'!O17+'5. Investissements'!O40+'5. Investissements'!O63","v":0},{"$f":"'5. Investissements'!P7+'5. Investissements'!P17+'5. Investissements'!P40+'5. Investissements'!P63","v":0},{"$f":"'5. Investissements'!Q7+'5. Investissements'!Q17+'5. Investissements'!Q40+'5. Investissements'!Q63","v":0},{"$f":"'5. Investissements'!R7+'5. Investissements'!R17+'5. Investissements'!R40+'5. Investissements'!R63","v":0},{"$f":"'5. Investissements'!S7+'5. Investissements'!S17+'5. Investissements'!S40+'5. Investissements'!S63","v":0},{"$f":"'5. Investissements'!T7+'5. Investissements'!T17+'5. Investissements'!T40+'5. Investissements'!T63","v":0},{"$f":"'5. Investissements'!U7+'5. Investissements'!U17+'5. Investissements'!U40+'5. Investissements'!U63","v":0},{"$f":"'5. Investissements'!V7+'5. Investissements'!V17+'5. Investissements'!V40+'5. Investissements'!V63","v":0},{"$f":"'5. Investissements'!W7+'5. Investissements'!W17+'5. Investissements'!W40+'5. Investissements'!W63","v":0},{"$f":"'5. Investissements'!X7+'5. Investissements'!X17+'5. Investissements'!X40+'5. Investissements'!X63","v":0},{"$f":"'5. Investissements'!Y7+'5. Investissements'!Y17+'5. Investissements'!Y40+'5. Investissements'!Y63","v":0},{"$f":"'5. Investissements'!Z7+'5. Investissements'!Z17+'5. Investissements'!Z40+'5. Investissements'!Z63","v":0},{"$f":"'5. Investissements'!AA7+'5. Investissements'!AA17+'5. Investissements'!AA40+'5. Investissements'!AA63","v":0},{"$f":"'5. Investissements'!AB7+'5. Investissements'!AB17+'5. Investissements'!AB40+'5. Investissements'!AB63","v":0},{"$f":"'5. Investissements'!AC7+'5. Investissements'!AC17+'5. Investissements'!AC40+'5. Investissements'!AC63","v":0},{"$f":"'5. Investissements'!AD7+'5. Investissements'!AD17+'5. Investissements'!AD40+'5. Investissements'!AD63","v":0},{"$f":"'5. Investissements'!AE7+'5. Investissements'!AE17+'5. Investissements'!AE40+'5. Investissements'!AE63","v":0},{"$f":"'5. Investissements'!AF7+'5. Investissements'!AF17+'5. Investissements'!AF40+'5. Investissements'!AF63","v":0},{"$f":"'5. Investissements'!AG7+'5. Investissements'!AG17+'5. Investissements'!AG40+'5. Investissements'!AG63","v":0},{"$f":"'5. Investissements'!AH7+'5. Investissements'!AH17+'5. Investissements'!AH40+'5. Investissements'!AH63","v":0},{"$f":"'5. Investissements'!AI7+'5. Investissements'!AI17+'5. Investissements'!AI40+'5. Investissements'!AI63","v":0},{"$f":"'5. Investissements'!AJ7+'5. Investissements'!AJ17+'5. Investissements'!AJ40+'5. Investissements'!AJ63","v":0},{"$f":"'5. Investissements'!AK7+'5. Investissements'!AK17+'5. Investissements'!AK40+'5. Investissements'!AK63","v":0},{"$f":"'5. Investissements'!AL7+'5. Investissements'!AL17+'5. Investissements'!AL40+'5. Investissements'!AL63","v":0},{"$f":"'5. Investissements'!AM7+'5. Investissements'!AM17+'5. Investissements'!AM40+'5. Investissements'!AM63","v":0},{"$f":"'5. Investissements'!AN7+'5. Investissements'!AN17+'5. Investissements'!AN40+'5. Investissements'!AN63","v":0},{"$f":"'5. Investissements'!AO7+'5. Investissements'!AO17+'5. Investissements'!AO40+'5. Investissements'!AO63","v":0},{"$f":"'5. Investissements'!AP7+'5. Investissements'!AP17+'5. Investissements'!AP40+'5. Investissements'!AP63","v":0},{"$f":"'5. Investissements'!AQ7+'5. Investissements'!AQ17+'5. Investissements'!AQ40+'5. Investissements'!AQ63","v":0},{"$f":"'5. Investissements'!AR7+'5. Investissements'!AR17+'5. Investissements'!AR40+'5. Investissements'!AR63","v":0},{"$f":"'5. Investissements'!AS7+'5. Investissements'!AS17+'5. Investissements'!AS40+'5. Investissements'!AS63","v":0},{"$f":"'5. Investissements'!AT7+'5. Investissements'!AT17+'5. Investissements'!AT40+'5. Investissements'!AT63","v":0},{"$f":"'5. Investissements'!AU7+'5. Investissements'!AU17+'5. Investissements'!AU40+'5. Investissements'!AU63","v":0},{"$f":"'5. Investissements'!AV7+'5. Investissements'!AV17+'5. Investissements'!AV40+'5. Investissements'!AV63","v":0},{"$f":"'5. Investissements'!AW7+'5. Investissements'!AW17+'5. Investissements'!AW40+'5. Investissements'!AW63","v":0},{"$f":"'5. Investissements'!AX7+'5. Investissements'!AX17+'5. Investissements'!AX40+'5. Investissements'!AX63","v":0},{"$f":"'5. Investissements'!AY7+'5. Investissements'!AY17+'5. Investissements'!AY40+'5. Investissements'!AY63","v":0},{"$f":"'5. Investissements'!AZ7+'5. Investissements'!AZ17+'5. Investissements'!AZ40+'5. Investissements'!AZ63","v":0},{"$f":"'5. Investissements'!BA7+'5. Investissements'!BA17+'5. Investissements'!BA40+'5. Investissements'!BA63","v":0},{"$f":"'5. Investissements'!BB7+'5. Investissements'!BB17+'5. Investissements'!BB40+'5. Investissements'!BB63","v":0},{"$f":"'5. Investissements'!BC7+'5. Investissements'!BC17+'5. Investissements'!BC40+'5. Investissements'!BC63","v":0},{"$f":"'5. Investissements'!BD7+'5. Investissements'!BD17+'5. Investissements'!BD40+'5. Investissements'!BD63","v":0},{"$f":"'5. Investissements'!BE7+'5. Investissements'!BE17+'5. Investissements'!BE40+'5. Investissements'!BE63","v":0},{"$f":"'5. Investissements'!BF7+'5. Investissements'!BF17+'5. Investissements'!BF40+'5. Investissements'!BF63","v":0},{"$f":"'5. Investissements'!BG7+'5. Investissements'!BG17+'5. Investissements'!BG40+'5. Investissements'!BG63","v":0},{"$f":"'5. Investissements'!BH7+'5. Investissements'!BH17+'5. Investissements'!BH40+'5. Investissements'!BH63","v":0},{"$f":"'5. Investissements'!BI7+'5. Investissements'!BI17+'5. Investissements'!BI40+'5. Investissements'!BI63","v":0},{"$f":"'5. Investissements'!BJ7+'5. Investissements'!BJ17+'5. Investissements'!BJ40+'5. Investissements'!BJ63","v":0},{"$f":"'5. Investissements'!BK7+'5. Investissements'!BK17+'5. Investissements'!BK40+'5. Investissements'!BK63","v":0},{"$f":"'5. Investissements'!BL7+'5. Investissements'!BL17+'5. Investissements'!BL40+'5. Investissements'!BL63","v":0},{"$f":"'5. Investissements'!BM7+'5. Investissements'!BM17+'5. Investissements'!BM40+'5. Investissements'!BM63","v":0},{"$f":"'5. Investissements'!BN7+'5. Investissements'!BN17+'5. Investissements'!BN40+'5. Investissements'!BN63","v":0},{"$f":"'5. Investissements'!BO7+'5. Investissements'!BO17+'5. Investissements'!BO40+'5. Investissements'!BO63","v":0},{"$f":"'5. Investissements'!BP7+'5. Investissements'!BP17+'5. Investissements'!BP40+'5. Investissements'!BP63","v":0},{"$f":"'5. Investissements'!BQ7+'5. Investissements'!BQ17+'5. Investissements'!BQ40+'5. Investissements'!BQ63","v":0},{"$f":"'5. Investissements'!BR7+'5. Investissements'!BR17+'5. Investissements'!BR40+'5. Investissements'!BR63","v":0},{"$f":"'5. Investissements'!BS7+'5. Investissements'!BS17+'5. Investissements'!BS40+'5. Investissements'!BS63","v":0},{"$f":"'5. Investissements'!BT7+'5. Investissements'!BT17+'5. Investissements'!BT40+'5. Investissements'!BT63","v":0},{"$f":"'5. Investissements'!BU7+'5. Investissements'!BU17+'5. Investissements'!BU40+'5. Investissements'!BU63","v":0},{"$f":"'5. Investissements'!BV7+'5. Investissements'!BV17+'5. Investissements'!BV40+'5. Investissements'!BV63","v":0},{"$f":"'5. Investissements'!BW7+'5. Investissements'!BW17+'5. Investissements'!BW40+'5. Investissements'!BW63","v":0},{"$f":"'5. Investissements'!BX7+'5. Investissements'!BX17+'5. Investissements'!BX40+'5. Investissements'!BX63","v":0},{"$f":"'5. Investissements'!BY7+'5. Investissements'!BY17+'5. Investissements'!BY40+'5. Investissements'!BY63","v":0},{"$f":"'5. Investissements'!BZ7+'5. Investissements'!BZ17+'5. Investissements'!BZ40+'5. Investissements'!BZ63","v":0},{"$f":"'5. Investissements'!CA7+'5. Investissements'!CA17+'5. Investissements'!CA40+'5. Investissements'!CA63","v":0},{"$f":"'5. Investissements'!CB7+'5. Investissements'!CB17+'5. Investissements'!CB40+'5. Investissements'!CB63","v":0}]
["Capex Maintenance",null,null,null,null,{"$f":"+'5. Investissements'!F89","v":0},{"$f":"+'5. Investissements'!G89","v":0},{"$f":"+'5. Investissements'!H89","v":0},{"$f":"+'5. Investissements'!I89","v":0},{"$f":"+'5. Investissements'!J89","v":0},{"$f":"+'5. Investissements'!K89","v":0},{"$f":"+'5. Investissements'!L89","v":0},{"$f":"+'5. Investissements'!M89","v":0},{"$f":"+'5. Investissements'!N89","v":0},{"$f":"+'5. Investissements'!O89","v":0},{"$f":"+'5. Investissements'!P89","v":0},{"$f":"+'5. Investissements'!Q89","v":0},{"$f":"+'5. Investissements'!R89","v":0},{"$f":"+'5. Investissements'!S89","v":0},{"$f":"+'5. Investissements'!T89","v":0},{"$f":"+'5. Investissements'!U89","v":0},{"$f":"+'5. Investissements'!V89","v":0},{"$f":"+'5. Investissements'!W89","v":0},{"$f":"+'5. Investissements'!X89","v":0},{"$f":"+'5. Investissements'!Y89","v":0},{"$f":"+'5. Investissements'!Z89","v":0},{"$f":"+'5. Investissements'!AA89","v":0},{"$f":"+'5. Investissements'!AB89","v":0},{"$f":"+'5. Investissements'!AC89","v":0},{"$f":"+'5. Investissements'!AD89","v":0},{"$f":"+'5. Investissements'!AE89","v":0},{"$f":"+'5. Investissements'!AF89","v":0},{"$f":"+'5. Investissements'!AG89","v":0},{"$f":"+'5. Investissements'!AH89","v":0},{"$f":"+'5. Investissements'!AI89","v":0},{"$f":"+'5. Investissements'!AJ89","v":0},{"$f":"+'5. Investissements'!AK89","v":0},{"$f":"+'5. Investissements'!AL89","v":0},{"$f":"+'5. Investissements'!AM89","v":0},{"$f":"+'5. Investissements'!AN89","v":0},{"$f":"+'5. Investissements'!AO89","v":0},{"$f":"+'5. Investissements'!AP89","v":0},{"$f":"+'5. Investissements'!AQ89","v":0},{"$f":"+'5. Investissements'!AR89","v":0},{"$f":"+'5. Investissements'!AS89","v":0},{"$f":"+'5. Investissements'!AT89","v":0},{"$f":"+'5. Investissements'!AU89","v":0},{"$f":"+'5. Investissements'!AV89","v":0},{"$f":"+'5. Investissements'!AW89","v":0},{"$f":"+'5. Investissements'!AX89","v":0},{"$f":"+'5. Investissements'!AY89","v":0},{"$f":"+'5. Investissements'!AZ89","v":0},{"$f":"+'5. Investissements'!BA89","v":0},{"$f":"+'5. Investissements'!BB89","v":0},{"$f":"+'5. Investissements'!BC89","v":0},{"$f":"+'5. Investissements'!BD89","v":0},{"$f":"+'5. Investissements'!BE89","v":0},{"$f":"+'5. Investissements'!BF89","v":0},{"$f":"+'5. Investissements'!BG89","v":0},{"$f":"+'5. Investissements'!BH89","v":0},{"$f":"+'5. Investissements'!BI89","v":0},{"$f":"+'5. Investissements'!BJ89","v":0},{"$f":"+'5. Investissements'!BK89","v":0},{"$f":"+'5. Investissements'!BL89","v":0},{"$f":"+'5. Investissements'!BM89","v":0},{"$f":"+'5. Investissements'!BN89","v":0},{"$f":"+'5. Investissements'!BO89","v":0},{"$f":"+'5. Investissements'!BP89","v":0},{"$f":"+'5. Investissements'!BQ89","v":0},{"$f":"+'5. Investissements'!BR89","v":0},{"$f":"+'5. Investissements'!BS89","v":0},{"$f":"+'5. Investissements'!BT89","v":0},{"$f":"+'5. Investissements'!BU89","v":0},{"$f":"+'5. Investissements'!BV89","v":0},{"$f":"+'5. Investissements'!BW89","v":0},{"$f":"+'5. Investissements'!BX89","v":0},{"$f":"+'5. Investissements'!BY89","v":0},{"$f":"+'5. Investissements'!BZ89","v":0},{"$f":"+'5. Investissements'!CA89","v":0},{"$f":"+'5. Investissements'!CB89","v":0}]
["Total Capex",null,null,null,null,{"$f":"SUM(F12:F13)","v":0},0,0,0,0,0,0,0,0,0,0,0,0,0,0,0,0,0,0,0,{"$f":"SUM(Z12:Z13)","v":0},0,0,{"$f":"SUM(AC12:AC13)","v":0},0,0,0,0,0,0,0,{"$f":"SUM(AK12:AK13)","v":0},0,0,0,0,0,0,0,0,0,0,0,0,0,0,0,0,0,0,0,0,0,0,0,0,0,0,0,0,0,0,0,0,0,0,0,0,0,0,0,0,0,0,0]
[]
["Emprunt et dette financière",null,null,null,null,{"$f":"'4. Bilan & ratios'!F63","v":0},{"$f":"'4. Bilan & ratios'!G63","v":0},{"$f":"'4. Bilan & ratios'!H63","v":0},{"$f":"'4. Bilan & ratios'!I63","v":0},{"$f":"'4. Bilan & ratios'!J63","v":0},{"$f":"'4. Bilan & ratios'!K63","v":0},{"$f":"'4. Bilan & ratios'!L63","v":0},{"$f":"'4. Bilan & ratios'!M63","v":0},{"$f":"'4. Bilan & ratios'!N63","v":0},{"$f":"'4. Bilan & ratios'!O63","v":0},{"$f":"'4. Bilan & ratios'!P63","v":0},{"$f":"'4. Bilan & ratios'!Q63","v":0},{"$f":"'4. Bilan & ratios'!R63","v":0},{"$f":"'4. Bilan & ratios'!S63","v":0},{"$f":"'4. Bilan & ratios'!T63","v":0},{"$f":"'4. Bilan & ratios'!U63","v":0},{"$f":"'4. Bilan & ratios'!V63","v":0},{"$f":"'4. Bilan & ratios'!W63","v":0},{"$f":"'4. Bilan & ratios'!X63","v":0},{"$f":"'4. Bilan & ratios'!Y63","v":0},{"$f":"'4. Bilan & ratios'!Z63","v":0},{"$f":"'4. Bilan & ratios'!AA63","v":0},{"$f":"'4. Bilan & ratios'!AB63","v":0},{"$f":"'4. Bilan & ratios'!AC63","v":0},{"$f":"'4. Bilan & ratios'!AD63","v":0},{"$f":"'4. Bilan & ratios'!AE63","v":0},{"$f":"'4. Bilan & ratios'!AF63","v":0},{"$f":"'4. Bilan & ratios'!AG63","v":0},{"$f":"'4. Bilan & ratios'!AH63","v":0},{"$f":"'4. Bilan & ratios'!AI63","v":0},{"$f":"'4. Bilan & ratios'!AJ63","v":0},{"$f":"'4. Bilan & ratios'!AK63","v":0},{"$f":"'4. Bilan & ratios'!AL63","v":0},{"$f":"'4. Bilan & ratios'!AM63","v":0},{"$f":"'4. Bilan & ratios'!AN63","v":0},{"$f":"'4. Bilan & ratios'!AO63","v":0},{"$f":"'4. Bilan & ratios'!AP63","v":0},{"$f":"'4. Bilan & ratios'!AQ63","v":0},{"$f":"'4. Bilan & ratios'!AR63","v":0},{"$f":"'4. Bilan & ratios'!AS63","v":0},{"$f":"'4. Bilan & ratios'!AT63","v":0},{"$f":"'4. Bilan & ratios'!AU63","v":0},{"$f":"'4. Bilan & ratios'!AV63","v":0},{"$f":"'4. Bilan & ratios'!AW63","v":0},{"$f":"'4. Bilan & ratios'!AX63","v":0},{"$f":"'4. Bilan & ratios'!AY63","v":0},{"$f":"'4. Bilan & ratios'!AZ63","v":0},{"$f":"'4. Bilan & ratios'!BA63","v":0},{"$f":"'4. Bilan & ratios'!BB63","v":0},{"$f":"'4. Bilan & ratios'!BC63","v":0},{"$f":"'4. Bilan & ratios'!BD63","v":0},{"$f":"'4. Bilan & ratios'!BE63","v":0},{"$f":"'4. Bilan & ratios'!BF63","v":0},{"$f":"'4. Bilan & ratios'!BG63","v":0},{"$f":"'4. Bilan & ratios'!BH63","v":0},{"$f":"'4. Bilan & ratios'!BI63","v":0},{"$f":"'4. Bilan & ratios'!BJ63","v":0},{"$f":"'4. Bilan & ratios'!BK63","v":0},{"$f":"'4. Bilan & ratios'!BL63","v":0},{"$f":"'4. Bilan & ratios'!BM63","v":0},{"$f":"'4. Bilan & ratios'!BN63","v":0},{"$f":"'4. Bilan & ratios'!BO63","v":0},{"$f":"'4. Bilan & ratios'!BP63","v":0},{"$f":"'4. Bilan & ratios'!BQ63","v":0},{"$f":"'4. Bilan & ratios'!BR63","v":0},{"$f":"'4. Bilan & ratios'!BS63","v":0},{"$f":"'4. Bilan & ratios'!BT63","v":0},{"$f":"'4. Bilan & ratios'!BU63","v":0},{"$f":"'4. Bilan & ratios'!BV63","v":0},{"$f":"'4. Bilan & ratios'!BW63","v":0},{"$f":"'4. Bilan & ratios'!BX63","v":0},{"$f":"'4. Bilan & ratios'!BY63","v":0},{"$f":"'4. Bilan & ratios'!BZ63","v":0},{"$f":"'4. Bilan & ratios'!CA63","v":0},{"$f":"'4. Bilan & ratios'!CB63","v":0}]
["Dette financière nette",null,null,null,null,{"$f":"'4. Bilan & ratios'!F65","v":0},{"$f":"'4. Bilan & ratios'!G65","v":0},{"$f":"'4. Bilan & ratios'!H65","v":0},{"$f":"'4. Bilan & ratios'!I65","v":0},{"$f":"'4. Bilan & ratios'!J65","v":0},{"$f":"'4. Bilan & ratios'!K65","v":0},{"$f":"'4. Bilan & ratios'!L65","v":0},{"$f":"'4. Bilan & ratios'!M65","v":0},{"$f":"'4. Bilan & ratios'!N65","v":0},{"$f":"'4. Bilan & ratios'!O65","v":0},{"$f":"'4. Bilan & ratios'!P65","v":0},{"$f":"'4. Bilan & ratios'!Q65","v":0},{"$f":"'4. Bilan & ratios'!R65","v":0},{"$f":"'4. Bilan & ratios'!S65","v":0},{"$f":"'4. Bilan & ratios'!T65","v":0},{"$f":"'4. Bilan & ratios'!U65","v":0},{"$f":"'4. Bilan & ratios'!V65","v":0},{"$f":"'4. Bilan & ratios'!W65","v":0},{"$f":"'4. Bilan & ratios'!X65","v":0},{"$f":"'4. Bilan & ratios'!Y65","v":0},{"$f":"'4. Bilan & ratios'!Z65","v":0},{"$f":"'4. Bilan & ratios'!AA65","v":0},{"$f":"'4. Bilan & ratios'!AB65","v":0},{"$f":"'4. Bilan & ratios'!AC65","v":0},{"$f":"'4. Bilan & ratios'!AD65","v":0},{"$f":"'4. Bilan & ratios'!AE65","v":0},{"$f":"'4. Bilan & ratios'!AF65","v":0},{"$f":"'4. Bilan & ratios'!AG65","v":0},{"$f":"'4. Bilan & ratios'!AH65","v":0},{"$f":"'4. Bilan & ratios'!AI65","v":0},{"$f":"'4. Bilan & ratios'!AJ65","v":0},{"$f":"'4. Bilan & ratios'!AK65","v":0},{"$f":"'4. Bilan & ratios'!AL65","v":0},{"$f":"'4. Bilan & ratios'!AM65","v":0},{"$f":"'4. Bilan & ratios'!AN65","v":0},{"$f":"'4. Bilan & ratios'!AO65","v":0},{"$f":"'4. Bilan & ratios'!AP65","v":0},{"$f":"'4. Bilan & ratios'!AQ65","v":0},{"$f":"'4. Bilan & ratios'!AR65","v":0},{"$f":"'4. Bilan & ratios'!AS65","v":0},{"$f":"'4. Bilan & ratios'!AT65","v":0},{"$f":"'4. Bilan & ratios'!AU65","v":0},{"$f":"'4. Bilan & ratios'!AV65","v":0},{"$f":"'4. Bilan & ratios'!AW65","v":0},{"$f":"'4. Bilan & ratios'!AX65","v":0},{"$f":"'4. Bilan & ratios'!AY65","v":0},{"$f":"'4. Bilan & ratios'!AZ65","v":0},{"$f":"'4. Bilan & ratios'!BA65","v":0},{"$f":"'4. Bilan & ratios'!BB65","v":0},{"$f":"'4. Bilan & ratios'!BC65","v":0},{"$f":"'4. Bilan & ratios'!BD65","v":0},{"$f":"'4. Bilan & ratios'!BE65","v":0},{"$f":"'4. Bilan & ratios'!BF65","v":0},{"$f":"'4. Bilan & ratios'!BG65","v":0},{"$f":"'4. Bilan & ratios'!BH65","v":0},{"$f":"'4. Bilan & ratios'!BI65","v":0},{"$f":"'4. Bilan & ratios'!BJ65","v":0},{"$f":"'4. Bilan & ratios'!BK65","v":0},{"$f":"'4. Bilan & ratios'!BL65","v":0},{"$f":"'4. Bilan & ratios'!BM65","v":0},{"$f":"'4. Bilan & ratios'!BN65","v":0},{"$f":"'4. Bilan & ratios'!BO65","v":0},{"$f":"'4. Bilan & ratios'!BP65","v":0},{"$f":"'4. Bilan & ratios'!BQ65","v":0},{"$f":"'4. Bilan & ratios'!BR65","v":0},{"$f":"'4. Bilan & ratios'!BS65","v":0},{"$f":"'4. Bilan & ratios'!BT65","v":0},{"$f":"'4. Bilan & ratios'!BU65","v":0},{"$f":"'4. Bilan & ratios'!BV65","v":0},{"$f":"'4. Bilan & ratios'!BW65","v":0},{"$f":"'4. Bilan & ratios'!BX65","v":0},{"$f":"'4. Bilan & ratios'!BY65","v":0},{"$f":"'4. Bilan & ratios'!BZ65","v":0},{"$f":"'4. Bilan & ratios'!CA65","v":0},{"$f":"'4. Bilan & ratios'!CB65","v":0}]
[]
["Cash Flow annuel",null,null,null,null,{"$f":"'3. CF'!F30","v":0},{"$f":"'3. CF'!G30","v":0},{"$f":"'3. CF'!H30","v":0},{"$f":"'3. CF'!I30","v":0},{"$f":"'3. CF'!J30","v":0},{"$f":"'3. CF'!K30","v":0},{"$f":"'3. CF'!L30","v":0},{"$f":"'3. CF'!M30","v":0},{"$f":"'3. CF'!N30","v":0},{"$f":"'3. CF'!O30","v":0},{"$f":"'3. CF'!P30","v":0},{"$f":"'3. CF'!Q30","v":0},{"$f":"'3. CF'!R30","v":0},{"$f":"'3. CF'!S30","v":0},{"$f":"'3. CF'!T30","v":0},{"$f":"'3. CF'!U30","v":0},{"$f":"'3. CF'!V30","v":0},{"$f":"'3. CF'!W30","v":0},{"$f":"'3. CF'!X30","v":0},{"$f":"'3. CF'!Y30","v":0},{"$f":"'3. CF'!Z30","v":0},{"$f":"'3. CF'!AA30","v":0},{"$f":"'3. CF'!AB30","v":0},{"$f":"'3. CF'!AC30","v":0},{"$f":"'3. CF'!AD30","v":0},{"$f":"'3. CF'!AE30","v":0},{"$f":"'3. CF'!AF30","v":0},{"$f":"'3. CF'!AG30","v":0},{"$f":"'3. CF'!AH30","v":0},{"$f":"'3. CF'!AI30","v":0},{"$f":"'3. CF'!AJ30","v":0},{"$f":"'3. CF'!AK30","v":0},{"$f":"'3. CF'!AL30","v":0},{"$f":"'3. CF'!AM30","v":0},{"$f":"'3. CF'!AN30","v":0},{"$f":"'3. CF'!AO30","v":0},{"$f":"'3. CF'!AP30","v":0},{"$f":"'3. CF'!AQ30","v":0},{"$f":"'3. CF'!AR30","v":0},{"$f":"'3. CF'!AS30","v":0},{"$f":"'3. CF'!AT30","v":0},{"$f":"'3. CF'!AU30","v":0},{"$f":"'3. CF'!AV30","v":0},{"$f":"'3. CF'!AW30","v":0},{"$f":"'3. CF'!AX30","v":0},{"$f":"'3. CF'!AY30","v":0},{"$f":"'3. CF'!AZ30","v":0},{"$f":"'3. CF'!BA30","v":0},{"$f":"'3. CF'!BB30","v":0},{"$f":"'3. CF'!BC30","v":0},{"$f":"'3. CF'!BD30","v":0},{"$f":"'3. CF'!BE30","v":0},{"$f":"'3. CF'!BF30","v":0},{"$f":"'3. CF'!BG30","v":0},{"$f":"'3. CF'!BH30","v":0},{"$f":"'3. CF'!BI30","v":0},{"$f":"'3. CF'!BJ30","v":0},{"$f":"'3. CF'!BK30","v":0},{"$f":"'3. CF'!BL30","v":0},{"$f":"'3. CF'!BM30","v":0},{"$f":"'3. CF'!BN30","v":0},{"$f":"'3. CF'!BO30","v":0},{"$f":"'3. CF'!BP30","v":0},{"$f":"'3. CF'!BQ30","v":0},{"$f":"'3. CF'!BR30","v":0},{"$f":"'3. CF'!BS30","v":0},{"$f":"'3. CF'!BT30","v":0},{"$f":"'3. CF'!BU30","v":0},{"$f":"'3. CF'!BV30","v":0},{"$f":"'3. CF'!BW30","v":0},{"$f":"'3. CF'!BX30","v":0},{"$f":"'3. CF'!BY30","v":0},{"$f":"'3. CF'!BZ30","v":0},{"$f":"'3. CF'!CA30","v":0},{"$f":"'3. CF'!CB30","v":0}]
["Cumul Cash Flow",null,null,null,null,{"$f":"'3. CF'!F33","v":0},{"$f":"'3. CF'!G33","v":0},{"$f":"'3. CF'!H33","v":0},{"$f":"'3. CF'!I33","v":0},{"$f":"'3. CF'!J33","v":0},{"$f":"'3. CF'!K33","v":0},{"$f":"'3. CF'!L33","v":0},{"$f":"'3. CF'!M33","v":0},{"$f":"'3. CF'!N33","v":0},{"$f":"'3. CF'!O33","v":0},{"$f":"'3. CF'!P33","v":0},{"$f":"'3. CF'!Q33","v":0},{"$f":"'3. CF'!R33","v":0},{"$f":"'3. CF'!S33","v":0},{"$f":"'3. CF'!T33","v":0},{"$f":"'3. CF'!U33","v":0},{"$f":"'3. CF'!V33","v":0},{"$f":"'3. CF'!W33","v":0},{"$f":"'3. CF'!X33","v":0},{"$f":"'3. CF'!Y33","v":0},{"$f":"'3. CF'!Z33","v":0},{"$f":"'3. CF'!AA33","v":0},{"$f":"'3. CF'!AB33","v":0},{"$f":"'3. CF'!AC33","v":0},{"$f":"'3. CF'!AD33","v":0},{"$f":"'3. CF'!AE33","v":0},{"$f":"'3. CF'!AF33","v":0},{"$f":"'3. CF'!AG33","v":0},{"$f":"'3. CF'!AH33","v":0},{"$f":"'3. CF'!AI33","v":0},{"$f":"'3. CF'!AJ33","v":0},{"$f":"'3. CF'!AK33","v":0},{"$f":"'3. CF'!AL33","v":0},{"$f":"'3. CF'!AM33","v":0},{"$f":"'3. CF'!AN33","v":0},{"$f":"'3. CF'!AO33","v":0},{"$f":"'3. CF'!AP33","v":0},{"$f":"'3. CF'!AQ33","v":0},{"$f":"'3. CF'!AR33","v":0},{"$f":"'3. CF'!AS33","v":0},{"$f":"'3. CF'!AT33","v":0},{"$f":"'3. CF'!AU33","v":0},{"$f":"'3. CF'!AV33","v":0},{"$f":"'3. CF'!AW33","v":0},{"$f":"'3. CF'!AX33","v":0},{"$f":"'3. CF'!AY33","v":0},{"$f":"'3. CF'!AZ33","v":0},{"$f":"'3. CF'!BA33","v":0},{"$f":"'3. CF'!BB33","v":0},{"$f":"'3. CF'!BC33","v":0},{"$f":"'3. CF'!BD33","v":0},{"$f":"'3. CF'!BE33","v":0},{"$f":"'3. CF'!BF33","v":0},{"$f":"'3. CF'!BG33","v":0},{"$f":"'3. CF'!BH33","v":0},{"$f":"'3. CF'!BI33","v":0},{"$f":"'3. CF'!BJ33","v":0},{"$f":"'3. CF'!BK33","v":0},{"$f":"'3. CF'!BL33","v":0},{"$f":"'3. CF'!BM33","v":0},{"$f":"'3. CF'!BN33","v":0},{"$f":"'3. CF'!BO33","v":0},{"$f":"'3. CF'!BP33","v":0},{"$f":"'3. CF'!BQ33","v":0},{"$f":"'3. CF'!BR33","v":0},{"$f":"'3. CF'!BS33","v":0},{"$f":"'3. CF'!BT33","v":0},{"$f":"'3. CF'!BU33","v":0},{"$f":"'3. CF'!BV33","v":0},{"$f":"'3. CF'!BW33","v":0},{"$f":"'3. CF'!BX33","v":0},{"$f":"'3. CF'!BY33","v":0},{"$f":"'3. CF'!BZ33","v":0},{"$f":"'3. CF'!CA33","v":0},{"$f":"'3. CF'!CB33","v":0}]
[]
["BFR",null,null,null,null,{"$f":"'4. Bilan & ratios'!F59","v":0},{"$f":"'4. Bilan & ratios'!G59","v":0},{"$f":"'4. Bilan & ratios'!H59","v":0},{"$f":"'4. Bilan & ratios'!I59","v":0},{"$f":"'4. Bilan & ratios'!J59","v":0},{"$f":"'4. Bilan & ratios'!K59","v":0},{"$f":"'4. Bilan & ratios'!L59","v":0},{"$f":"'4. Bilan & ratios'!M59","v":0},{"$f":"'4. Bilan & ratios'!N59","v":0},{"$f":"'4. Bilan & ratios'!O59","v":0},{"$f":"'4. Bilan & ratios'!P59","v":0},{"$f":"'4. Bilan & ratios'!Q59","v":0},{"$f":"'4. Bilan & ratios'!R59","v":0},{"$f":"'4. Bilan & ratios'!S59","v":0},{"$f":"'4. Bilan & ratios'!T59","v":0},{"$f":"'4. Bilan & ratios'!U59","v":0},{"$f":"'4. Bilan & ratios'!V59","v":0},{"$f":"'4. Bilan & ratios'!W59","v":0},{"$f":"'4. Bilan & ratios'!X59","v":0},{"$f":"'4. Bilan & ratios'!Y59","v":0},{"$f":"'4. Bilan & ratios'!Z59","v":0},{"$f":"'4. Bilan & ratios'!AA59","v":0},{"$f":"'4. Bilan & ratios'!AB59","v":0},{"$f":"'4. Bilan & ratios'!AC59","v":0},{"$f":"'4. Bilan & ratios'!AD59","v":0},{"$f":"'4. Bilan & ratios'!AE59","v":0},{"$f":"'4. Bilan & ratios'!AF59","v":0},{"$f":"'4. Bilan & ratios'!AG59","v":0},{"$f":"'4. Bilan & ratios'!AH59","v":0},{"$f":"'4. Bilan & ratios'!AI59","v":0},{"$f":"'4. Bilan & ratios'!AJ59","v":0},{"$f":"'4. Bilan & ratios'!AK59","v":0},{"$f":"'4. Bilan & ratios'!AL59","v":0},{"$f":"'4. Bilan & ratios'!AM59","v":0},{"$f":"'4. Bilan & ratios'!AN59","v":0},{"$f":"'4. Bilan & ratios'!AO59","v":0},{"$f":"'4. Bilan & ratios'!AP59","v":0},{"$f":"'4. Bilan & ratios'!AQ59","v":0},{"$f":"'4. Bilan & ratios'!AR59","v":0},{"$f":"'4. Bilan & ratios'!AS59","v":0},{"$f":"'4. Bilan & ratios'!AT59","v":0},{"$f":"'4. Bilan & ratios'!AU59","v":0},{"$f":"'4. Bilan & ratios'!AV59","v":0},{"$f":"'4. Bilan & ratios'!AW59","v":0},{"$f":"'4. Bilan & ratios'!AX59","v":0},{"$f":"'4. Bilan & ratios'!AY59","v":0},{"$f":"'4. Bilan & ratios'!AZ59","v":0},{"$f":"'4. Bilan & ratios'!BA59","v":0},{"$f":"'4. Bilan & ratios'!BB59","v":0},{"$f":"'4. Bilan & ratios'!BC59","v":0},{"$f":"'4. Bilan & ratios'!BD59","v":0},{"$f":"'4. Bilan & ratios'!BE59","v":0},{"$f":"'4. Bilan & ratios'!BF59","v":0},{"$f":"'4. Bilan & ratios'!BG59","v":0},{"$f":"'4. Bilan & ratios'!BH59","v":0},{"$f":"'4. Bilan & ratios'!BI59","v":0},{"$f":"'4. Bilan & ratios'!BJ59","v":0},{"$f":"'4. Bilan & ratios'!BK59","v":0},{"$f":"'4. Bilan & ratios'!BL59","v":0},{"$f":"'4. Bilan & ratios'!BM59","v":0},{"$f":"'4. Bilan & ratios'!BN59","v":0},{"$f":"'4. Bilan & ratios'!BO59","v":0},{"$f":"'4. Bilan & ratios'!BP59","v":0},{"$f":"'4. Bilan & ratios'!BQ59","v":0},{"$f":"'4. Bilan & ratios'!BR59","v":0},{"$f":"'4. Bilan & ratios'!BS59","v":0},{"$f":"'4. Bilan & ratios'!BT59","v":0},{"$f":"'4. Bilan & ratios'!BU59","v":0},{"$f":"'4. Bilan & ratios'!BV59","v":0},{"$f":"'4. Bilan & ratios'!BW59","v":0},{"$f":"'4. Bilan & ratios'!BX59","v":0},{"$f":"'4. Bilan & ratios'!BY59","v":0},{"$f":"'4. Bilan & ratios'!BZ59","v":0},{"$f":"'4. Bilan & ratios'!CA59","v":0},{"$f":"'4. Bilan & ratios'!CB59","v":0}]

{"sheet":"9. Checks (ARAFER)","index":9,"n_rows":72,"n_cols":80,"rows_kept":72,"cut":false,"hidden":true,"merged":[[3,0,3,27]]}
[]
[]
[{"$f":"'1. Info'!$D$5","v":0}]
["Indices / Evolutions"]
[]
[null,"Obkjectif du Check",null,null,"Checks","2015 (p)","2015 (r)","2016 (p)","2016 (r)","2017 (p)","2018 (p)","2019 (p)","2020 (p)","2021 (p)","2022 (p)","2023 (p)","2024 (p)","2025 (p)","2026 (p)","2027 (p)","2028 (p)","2029 (p)","2030 (p)","2031 (p)","2032 (p)","2033 (p)","2034 (p)","2035 (p)","2036 (p)","2037 (p)","2038 (p)","2039 (p)","2040 (p)","2041 (p)","2042 (p)","2043 (p)","2044 (p)","2045 (p)","2046 (p)","2047 (p)","2048 (p)","2049 (p)","2050 (p)","2051 (p)","2052 (p)","2053 (p)","2054 (p)","2055 (p)","2056 (p)","2057 (p)","2058 (p)","2059 (p)","2060 (p)","2061 (p)","2062 (p)","2063 (p)","2064 (p)","2065 (p)","2066 (p)","2067 (p)","2068 (p)","2069 (p)","2070 (p)","2071 (p)","2072 (p)","2073 (p)","2074 (p)","2075 (p)","2076 (p)","2077 (p)","2078 (p)","2079 (p)","2080 (p)","2081 (p)","2082 (p)","2083 (p)","2084 (p)","2085 (p)","2086 (p)","2087 (p)"]
[]
[]
["Checks P&L"]
[]
["Check détail par classe du CA Péage","Cohérence Evolution globale et détail de l'évolution",null,null,{"$f":"IF(ABS(SUM(F11:AB11))<(10^-2)%, \"OK\", \"CHECK\")","v":"OK"},{"$f":"IFERROR('2. P&L'!F36-('2. P&L'!F37*('2. P&L'!F34/'2. P&L'!F33)+'2. P&L'!F38*('2. P&L'!F35/'2. P&L'!F33)),\"\")","v":""},{"$f":"IFERROR('2. P&L'!G36-('2. P&L'!G37*('2. P&L'!G34/'2. P&L'!G33)+'2. P&L'!G38*('2. P&L'!G35/'2. P&L'!G33)),\"\")","v":""},{"$f":"IFERROR('2. P&L'!H36-('2. P&L'!H37*('2. P&L'!H34/'2. P&L'!H33)+'2. P&L'!H38*('2. P&L'!H35/'2. P&L'!H33)),\"\")","v":""},{"$f":"IFERROR('2. P&L'!I36-('2. P&L'!I37*('2. P&L'!I34/'2. P&L'!I33)+'2. P&L'!I38*('2. P&L'!I35/'2. P&L'!I33)),\"\")","v":""},{"$f":"IFERROR('2. P&L'!J36-('2. P&L'!J37*('2. P&L'!J34/'2. P&L'!J33)+'2. P&L'!J38*('2. P&L'!J35/'2. P&L'!J33)),\"\")","v":""},{"$f":"IFERROR('2. P&L'!K36-('2. P&L'!K37*('2. P&L'!K34/'2. P&L'!K33)+'2. P&L'!K38*('2. P&L'!K35/'2. P&L'!K33)),\"\")","v":""},{"$f":"IFERROR('2. P&L'!L36-('2. P&L'!L37*('2. P&L'!L34/'2. P&L'!L33)+'2. P&L'!L38*('2. P&L'!L35/'2. P&L'!L33)),\"\")","v":""},{"$f":"IFERROR('2. P&L'!M36-('2. P&L'!M37*('2. P&L'!M34/'2. P&L'!M33)+'2. P&L'!M38*('2. P&L'!M35/'2. P&L'!M33)),\"\")","v":""},{"$f":"IFERROR('2. P&L'!N36-('2. P&L'!N37*('2. P&L'!N34/'2. P&L'!N33)+'2. P&L'!N38*('2. P&L'!N35/'2. P&L'!N33)),\"\")","v":""},{"$f":"IFERROR('2. P&L'!O36-('2. P&L'!O37*('2. P&L'!O34/'2. P&L'!O33)+'2. P&L'!O38*('2. P&L'!O35/'2. P&L'!O33)),\"\")","v":""},{"$f":"IFERROR('2. P&L'!P36-('2. P&L'!P37*('2. P&L'!P34/'2. P&L'!P33)+'2. P&L'!P38*('2. P&L'!P35/'2. P&L'!P33)),\"\")","v":""},{"$f":"IFERROR('2. P&L'!Q36-('2. P&L'!Q37*('2. P&L'!Q34/'2. P&L'!Q33)+'2. P&L'!Q38*('2. P&L'!Q35/'2. P&L'!Q33)),\"\")","v":""},{"$f":"IFERROR('2. P&L'!R36-('2. P&L'!R37*('2. P&L'!R34/'2. P&L'!R33)+'2. P&L'!R38*('2. P&L'!R35/'2. P&L'!R33)),\"\")","v":""},{"$f":"IFERROR('2. P&L'!S36-('2. P&L'!S37*('2. P&L'!S34/'2. P&L'!S33)+'2. P&L'!S38*('2. P&L'!S35/'2. P&L'!S33)),\"\")","v":""},{"$f":"IFERROR('2. P&L'!T36-('2. P&L'!T37*('2. P&L'!T34/'2. P&L'!T33)+'2. P&L'!T38*('2. P&L'!T35/'2. P&L'!T33)),\"\")","v":""},{"$f":"IFERROR('2. P&L'!U36-('2. P&L'!U37*('2. P&L'!U34/'2. P&L'!U33)+'2. P&L'!U38*('2. P&L'!U35/'2. P&L'!U33)),\"\")","v":""},{"$f":"IFERROR('2. P&L'!V36-('2. P&L'!V37*('2. P&L'!V34/'2. P&L'!V33)+'2. P&L'!V38*('2. P&L'!V35/'2. P&L'!V33)),\"\")","v":""},{"$f":"IFERROR('2. P&L'!W36-('2. P&L'!W37*('2. P&L'!W34/'2. P&L'!W33)+'2. P&L'!W38*('2. P&L'!W35/'2. P&L'!W33)),\"\")","v":""},{"$f":"IFERROR('2. P&L'!X36-('2. P&L'!X37*('2. P&L'!X34/'2. P&L'!X33)+'2. P&L'!X38*('2. P&L'!X35/'2. P&L'!X33)),\"\")","v":""},{"$f":"IFERROR('2. P&L'!Y36-('2. P&L'!Y37*('2. P&L'!Y34/'2. P&L'!Y33)+'2. P&L'!Y38*('2. P&L'!Y35/'2. P&L'!Y33)),\"\")","v":""},{"$f":"IFERROR('2. P&L'!Z36-('2. P&L'!Z37*('2. P&L'!Z34/'2. P&L'!Z33)+'2. P&L'!Z38*('2. P&L'!Z35/'2. P&L'!Z33)),\"\")","v":""},{"$f":"IFERROR('2. P&L'!AA36-('2. P&L'!AA37*('2. P&L'!AA34/'2. P&L'!AA33)+'2. P&L'!AA38*('2. P&L'!AA35/'2. P&L'!AA33)),\"\")","v":""},{"$f":"IFERROR('2. P&L'!AB36-('2. P&L'!AB37*('2. P&L'!AB34/'2. P&L'!AB33)+'2. P&L'!AB38*('2. P&L'!AB35/'2. P&L'!AB33)),\"\")","v":""},{"$f":"IFERROR('2. P&L'!AC36-('2. P&L'!AC37*('2. P&L'!AC34/'2. P&L'!AC33)+'2. P&L'!AC38*('2. P&L'!AC35/'2. P&L'!AC33)),\"\")","v":""},{"$f":"IFERROR('2. P&L'!AD36-('2. P&L'!AD37*('2. P&L'!AD34/'2. P&L'!AD33)+'2. P&L'!AD38*('2. P&L'!AD35/'2. P&L'!AD33)),\"\")","v":""},{"$f":"IFERROR('2. P&L'!AE36-('2. P&L'!AE37*('2. P&L'!AE34/'2. P&L'!AE33)+'2. P&L'!AE38*('2. P&L'!AE35/'2. P&L'!AE33)),\"\")","v":""},{"$f":"IFERROR('2. P&L'!AF36-('2. P&L'!AF37*('2. P&L'!AF34/'2. P&L'!AF33)+'2. P&L'!AF38*('2. P&L'!AF35/'2. P&L'!AF33)),\"\")","v":""},{"$f":"IFERROR('2. P&L'!AG36-('2. P&L'!AG37*('2. P&L'!AG34/'2. P&L'!AG33)+'2. P&L'!AG38*('2. P&L'!AG35/'2. P&L'!AG33)),\"\")","v":""},{"$f":"IFERROR('2. P&L'!AH36-('2. P&L'!AH37*('2. P&L'!AH34/'2. P&L'!AH33)+'2. P&L'!AH38*('2. P&L'!AH35/'2. P&L'!AH33)),\"\")","v":""},{"$f":"IFERROR('2. P&L'!AI36-('2. P&L'!AI37*('2. P&L'!AI34/'2. P&L'!AI33)+'2. P&L'!AI38*('2. P&L'!AI35/'2. P&L'!AI33)),\"\")","v":""},{"$f":"IFERROR('2. P&L'!AJ36-('2. P&L'!AJ37*('2. P&L'!AJ34/'2. P&L'!AJ33)+'2. P&L'!AJ38*('2. P&L'!AJ35/'2. P&L'!AJ33)),\"\")","v":""},{"$f":"IFERROR('2. P&L'!AK36-('2. P&L'!AK37*('2. P&L'!AK34/'2. P&L'!AK33)+'2. P&L'!AK38*('2. P&L'!AK35/'2. P&L'!AK33)),\"\")","v":""},{"$f":"IFERROR('2. P&L'!AL36-('2. P&L'!AL37*('2. P&L'!AL34/'2. P&L'!AL33)+'2. P&L'!AL38*('2. P&L'!AL35/'2. P&L'!AL33)),\"\")","v":""},{"$f":"IFERROR('2. P&L'!AM36-('2. P&L'!AM37*('2. P&L'!AM34/'2. P&L'!AM33)+'2. P&L'!AM38*('2. P&L'!AM35/'2. P&L'!AM33)),\"\")","v":""},{"$f":"IFERROR('2. P&L'!AN36-('2. P&L'!AN37*('2. P&L'!AN34/'2. P&L'!AN33)+'2. P&L'!AN38*('2. P&L'!AN35/'2. P&L'!AN33)),\"\")","v":""},{"$f":"IFERROR('2. P&L'!AO36-('2. P&L'!AO37*('2. P&L'!AO34/'2. P&L'!AO33)+'2. P&L'!AO38*('2. P&L'!AO35/'2. P&L'!AO33)),\"\")","v":""},{"$f":"IFERROR('2. P&L'!AP36-('2. P&L'!AP37*('2. P&L'!AP34/'2. P&L'!AP33)+'2. P&L'!AP38*('2. P&L'!AP35/'2. P&L'!AP33)),\"\")","v":""},{"$f":"IFERROR('2. P&L'!AQ36-('2. P&L'!AQ37*('2. P&L'!AQ34/'2. P&L'!AQ33)+'2. P&L'!AQ38*('2. P&L'!AQ35/'2. P&L'!AQ33)),\"\")","v":""},{"$f":"IFERROR('2. P&L'!AR36-('2. P&L'!AR37*('2. P&L'!AR34/'2. P&L'!AR33)+'2. P&L'!AR38*('2. P&L'!AR35/'2. P&L'!AR33)),\"\")","v":""},{"$f":"IFERROR('2. P&L'!AS36-('2. P&L'!AS37*('2. P&L'!AS34/'2. P&L'!AS33)+'2. P&L'!AS38*('2. P&L'!AS35/'2. P&L'!AS33)),\"\")","v":""},{"$f":"IFERROR('2. P&L'!AT36-('2. P&L'!AT37*('2. P&L'!AT34/'2. P&L'!AT33)+'2. P&L'!AT38*('2. P&L'!AT35/'2. P&L'!AT33)),\"\")","v":""},{"$f":"IFERROR('2. P&L'!AU36-('2. P&L'!AU37*('2. P&L'!AU34/'2. P&L'!AU33)+'2. P&L'!AU38*('2. P&L'!AU35/'2. P&L'!AU33)),\"\")","v":""},{"$f":"IFERROR('2. P&L'!AV36-('2. P&L'!AV37*('2. P&L'!AV34/'2. P&L'!AV33)+'2. P&L'!AV38*('2. P&L'!AV35/'2. P&L'!AV33)),\"\")","v":""},{"$f":"IFERROR('2. P&L'!AW36-('2. P&L'!AW37*('2. P&L'!AW34/'2. P&L'!AW33)+'2. P&L'!AW38*('2. P&L'!AW35/'2. P&L'!AW33)),\"\")","v":""},{"$f":"IFERROR('2. P&L'!AX36-('2. P&L'!AX37*('2. P&L'!AX34/'2. P&L'!AX33)+'2. P&L'!AX38*('2. P&L'!AX35/'2. P&L'!AX33)),\"\")","v":""},{"$f":"IFERROR('2. P&L'!AY36-('2. P&L'!AY37*('2. P&L'!AY34/'2. P&L'!AY33)+'2. P&L'!AY38*('2. P&L'!AY35/'2. P&L'!AY33)),\"\")","v":""},{"$f":"IFERROR('2. P&L'!AZ36-('2. P&L'!AZ37*('2. P&L'!AZ34/'2. P&L'!AZ33)+'2. P&L'!AZ38*('2. P&L'!AZ35/'2. P&L'!AZ33)),\"\")","v":""},{"$f":"IFERROR('2. P&L'!BA36-('2. P&L'!BA37*('2. P&L'!BA34/'2. P&L'!BA33)+'2. P&L'!BA38*('2. P&L'!BA35/'2. P&L'!BA33)),\"\")","v":""},{"$f":"IFERROR('2. P&L'!BB36-('2. P&L'!BB37*('2. P&L'!BB34/'2. P&L'!BB33)+'2. P&L'!BB38*('2. P&L'!BB35/'2. P&L'!BB33)),\"\")","v":""},{"$f":"IFERROR('2. P&L'!BC36-('2. P&L'!BC37*('2. P&L'!BC34/'2. P&L'!BC33)+'2. P&L'!BC38*('2. P&L'!BC35/'2. P&L'!BC33)),\"\")","v":""},{"$f":"IFERROR('2. P&L'!BD36-('2. P&L'!BD37*('2. P&L'!BD34/'2. P&L'!BD33)+'2. P&L'!BD38*('2. P&L'!BD35/'2. P&L'!BD33)),\"\")","v":""},{"$f":"IFERROR('2. P&L'!BE36-('2. P&L'!BE37*('2. P&L'!BE34/'2. P&L'!BE33)+'2. P&L'!BE38*('2. P&L'!BE35/'2. P&L'!BE33)),\"\")","v":""},{"$f":"IFERROR('2. P&L'!BF36-('2. P&L'!BF37*('2. P&L'!BF34/'2. P&L'!BF33)+'2. P&L'!BF38*('2. P&L'!BF35/'2. P&L'!BF33)),\"\")","v":""},{"$f":"IFERROR('2. P&L'!BG36-('2. P&L'!BG37*('2. P&L'!BG34/'2. P&L'!BG33)+'2. P&L'!BG38*('2. P&L'!BG35/'2. P&L'!BG33)),\"\")","v":""},{"$f":"IFERROR('2. P&L'!BH36-('2. P&L'!BH37*('2. P&L'!BH34/'2. P&L'!BH33)+'2. P&L'!BH38*('2. P&L'!BH35/'2. P&L'!BH33)),\"\")","v":""},{"$f":"IFERROR('2. P&L'!BI36-('2. P&L'!BI37*('2. P&L'!BI34/'2. P&L'!BI33)+'2. P&L'!BI38*('2. P&L'!BI35/'2. P&L'!BI33)),\"\")","v":""},{"$f":"IFERROR('2. P&L'!BJ36-('2. P&L'!BJ37*('2. P&L'!BJ34/'2. P&L'!BJ33)+'2. P&L'!BJ38*('2. P&L'!BJ35/'2. P&L'!BJ33)),\"\")","v":""},{"$f":"IFERROR('2. P&L'!BK36-('2. P&L'!BK37*('2. P&L'!BK34/'2. P&L'!BK33)+'2. P&L'!BK38*('2. P&L'!BK35/'2. P&L'!BK33)),\"\")","v":""},{"$f":"IFERROR('2. P&L'!BL36-('2. P&L'!BL37*('2. P&L'!BL34/'2. P&L'!BL33)+'2. P&L'!BL38*('2. P&L'!BL35/'2. P&L'!BL33)),\"\")","v":""},{"$f":"IFERROR('2. P&L'!BM36-('2. P&L'!BM37*('2. P&L'!BM34/'2. P&L'!BM33)+'2. P&L'!BM38*('2. P&L'!BM35/'2. P&L'!BM33)),\"\")","v":""},{"$f":"IFERROR('2. P&L'!BN36-('2. P&L'!BN37*('2. P&L'!BN34/'2. P&L'!BN33)+'2. P&L'!BN38*('2. P&L'!BN35/'2. P&L'!BN33)),\"\")","v":""},{"$f":"IFERROR('2. P&L'!BO36-('2. P&L'!BO37*('2. P&L'!BO34/'2. P&L'!BO33)+'2. P&L'!BO38*('2. P&L'!BO35/'2. P&L'!BO33)),\"\")","v":""},{"$f":"IFERROR('2. P&L'!BP36-('2. P&L'!BP37*('2. P&L'!BP34/'2. P&L'!BP33)+'2. P&L'!BP38*('2. P&L'!BP35/'2. P&L'!BP33)),\"\")","v":""},{"$f":"IFERROR('2. P&L'!BQ36-('2. P&L'!BQ37*('2. P&L'!BQ34/'2. P&L'!BQ33)+'2. P&L'!BQ38*('2. P&L'!BQ35/'2. P&L'!BQ33)),\"\")","v":""},{"$f":"IFERROR('2. P&L'!BR36-('2. P&L'!BR37*('2. P&L'!BR34/'2. P&L'!BR33)+'2. P&L'!BR38*('2. P&L'!BR35/'2. P&L'!BR33)),\"\")","v":""},{"$f":"IFERROR('2. P&L'!BS36-('2. P&L'!BS37*('2. P&L'!BS34/'2. P&L'!BS33)+'2. P&L'!BS38*('2. P&L'!BS35/'2. P&L'!BS33)),\"\")","v":""},{"$f":"IFERROR('2. P&L'!BT36-('2. P&L'!BT37*('2. P&L'!BT34/'2. P&L'!BT33)+'2. P&L'!BT38*('2. P&L'!BT35/'2. P&L'!BT33)),\"\")","v":""},{"$f":"IFERROR('2. P&L'!BU36-('2. P&L'!BU37*('2. P&L'!BU34/'2. P&L'!BU33)+'2. P&L'!BU38*('2. P&L'!BU35/'2. P&L'!BU33)),\"\")","v":""},{"$f":"IFERROR('2. P&L'!BV36-('2. P&L'!BV37*('2. P&L'!BV34/'2. P&L'!BV33)+'2. P&L'!BV38*('2. P&L'!BV35/'2. P&L'!BV33)),\"\")","v":""},{"$f":"IFERROR('2. P&L'!BW36-('2. P&L'!BW37*('2. P&L'!BW34/'2. P&L'!BW33)+'2. P&L'!BW38*('2. P&L'!BW35/'2. P&L'!BW33)),\"\")","v":""},{"$f":"IFERROR('2. P&L'!BX36-('2. P&L'!BX37*('2. P&L'!BX34/'2. P&L'!BX33)+'2. P&L'!BX38*('2. P&L'!BX35/'2. P&L'!BX33)),\"\")","v":""},{"$f":"IFERROR('2. P&L'!BY36-('2. P&L'!BY37*('2. P&L'!BY34/'2. P&L'!BY33)+'2. P&L'!BY38*('2. P&L'!BY35/'2. P&L'!BY33)),\"\")","v":""},{"$f":"IFERROR('2. P&L'!BZ36-('2. P&L'!BZ37*('2. P&L'!BZ34/'2. P&L'!BZ33)+'2. P&L'!BZ38*('2. P&L'!BZ35/'2. P&L'!BZ33)),\"\")","v":""},{"$f":"IFERROR('2. P&L'!CA36-('2. P&L'!CA37*('2. P&L'!CA34/'2. P&L'!CA33)+'2. P&L'!CA38*('2. P&L'!CA35/'2. P&L'!CA33)),\"\")","v":""},{"$f":"IFERROR('2. P&L'!CB36-('2. P&L'!CB37*('2. P&L'!CB34/'2. P&L'!CB33)+'2. P&L'!CB38*('2. P&L'!CB35/'2. P&L'!CB33)),\"\")","v":""}]
["Check détail par classe du CA Péage concession 1","Cohérence Evolution globale et détail de l'évolution",null,null,{"$f":"IF(ABS(SUM(F12:AB12))<(10^-2)%, \"OK\", \"CHECK\")","v":"OK"},{"$f":"IFERROR('2. P&L'!F122-('2. P&L'!F123*('2. P&L'!F120/'2. P&L'!F119)+'2. P&L'!F124*('2. P&L'!F121/'2. P&L'!F119)),\"\")","v":""},{"$f":"IFERROR('2. P&L'!G122-('2. P&L'!G123*('2. P&L'!G120/'2. P&L'!G119)+'2. P&L'!G124*('2. P&L'!G121/'2. P&L'!G119)),\"\")","v":""},{"$f":"IFERROR('2. P&L'!H122-('2. P&L'!H123*('2. P&L'!H120/'2. P&L'!H119)+'2. P&L'!H124*('2. P&L'!H121/'2. P&L'!H119)),\"\")","v":""},{"$f":"IFERROR('2. P&L'!I122-('2. P&L'!I123*('2. P&L'!I120/'2. P&L'!I119)+'2. P&L'!I124*('2. P&L'!I121/'2. P&L'!I119)),\"\")","v":""},{"$f":"IFERROR('2. P&L'!J122-('2. P&L'!J123*('2. P&L'!J120/'2. P&L'!J119)+'2. P&L'!J124*('2. P&L'!J121/'2. P&L'!J119)),\"\")","v":""},{"$f":"IFERROR('2. P&L'!K122-('2. P&L'!K123*('2. P&L'!K120/'2. P&L'!K119)+'2. P&L'!K124*('2. P&L'!K121/'2. P&L'!K119)),\"\")","v":""},{"$f":"IFERROR('2. P&L'!L122-('2. P&L'!L123*('2. P&L'!L120/'2. P&L'!L119)+'2. P&L'!L124*('2. P&L'!L121/'2. P&L'!L119)),\"\")","v":""},{"$f":"IFERROR('2. P&L'!M122-('2. P&L'!M123*('2. P&L'!M120/'2. P&L'!M119)+'2. P&L'!M124*('2. P&L'!M121/'2. P&L'!M119)),\"\")","v":""},{"$f":"IFERROR('2. P&L'!N122-('2. P&L'!N123*('2. P&L'!N120/'2. P&L'!N119)+'2. P&L'!N124*('2. P&L'!N121/'2. P&L'!N119)),\"\")","v":""},{"$f":"IFERROR('2. P&L'!O122-('2. P&L'!O123*('2. P&L'!O120/'2. P&L'!O119)+'2. P&L'!O124*('2. P&L'!O121/'2. P&L'!O119)),\"\")","v":""},{"$f":"IFERROR('2. P&L'!P122-('2. P&L'!P123*('2. P&L'!P120/'2. P&L'!P119)+'2. P&L'!P124*('2. P&L'!P121/'2. P&L'!P119)),\"\")","v":""},{"$f":"IFERROR('2. P&L'!Q122-('2. P&L'!Q123*('2. P&L'!Q120/'2. P&L'!Q119)+'2. P&L'!Q124*('2. P&L'!Q121/'2. P&L'!Q119)),\"\")","v":""},{"$f":"IFERROR('2. P&L'!R122-('2. P&L'!R123*('2. P&L'!R120/'2. P&L'!R119)+'2. P&L'!R124*('2. P&L'!R121/'2. P&L'!R119)),\"\")","v":""},{"$f":"IFERROR('2. P&L'!S122-('2. P&L'!S123*('2. P&L'!S120/'2. P&L'!S119)+'2. P&L'!S124*('2. P&L'!S121/'2. P&L'!S119)),\"\")","v":""},{"$f":"IFERROR('2. P&L'!T122-('2. P&L'!T123*('2. P&L'!T120/'2. P&L'!T119)+'2. P&L'!T124*('2. P&L'!T121/'2. P&L'!T119)),\"\")","v":""},{"$f":"IFERROR('2. P&L'!U122-('2. P&L'!U123*('2. P&L'!U120/'2. P&L'!U119)+'2. P&L'!U124*('2. P&L'!U121/'2. P&L'!U119)),\"\")","v":""},{"$f":"IFERROR('2. P&L'!V122-('2. P&L'!V123*('2. P&L'!V120/'2. P&L'!V119)+'2. P&L'!V124*('2. P&L'!V121/'2. P&L'!V119)),\"\")","v":""},{"$f":"IFERROR('2. P&L'!W122-('2. P&L'!W123*('2. P&L'!W120/'2. P&L'!W119)+'2. P&L'!W124*('2. P&L'!W121/'2. P&L'!W119)),\"\")","v":""},{"$f":"IFERROR('2. P&L'!X122-('2. P&L'!X123*('2. P&L'!X120/'2. P&L'!X119)+'2. P&L'!X124*('2. P&L'!X121/'2. P&L'!X119)),\"\")","v":""},{"$f":"IFERROR('2. P&L'!Y122-('2. P&L'!Y123*('2. P&L'!Y120/'2. P&L'!Y119)+'2. P&L'!Y124*('2. P&L'!Y121/'2. P&L'!Y119)),\"\")","v":""},{"$f":"IFERROR('2. P&L'!Z122-('2. P&L'!Z123*('2. P&L'!Z120/'2. P&L'!Z119)+'2. P&L'!Z124*('2. P&L'!Z121/'2. P&L'!Z119)),\"\")","v":""},{"$f":"IFERROR('2. P&L'!AA122-('2. P&L'!AA123*('2. P&L'!AA120/'2. P&L'!AA119)+'2. P&L'!AA124*('2. P&L'!AA121/'2. P&L'!AA119)),\"\")","v":""},{"$f":"IFERROR('2. P&L'!AB122-('2. P&L'!AB123*('2. P&L'!AB120/'2. P&L'!AB119)+'2. P&L'!AB124*('2. P&L'!AB121/'2. P&L'!AB119)),\"\")","v":""},{"$f":"IFERROR('2. P&L'!AC122-('2. P&L'!AC123*('2. P&L'!AC120/'2. P&L'!AC119)+'2. P&L'!AC124*('2. P&L'!AC121/'2. P&L'!AC119)),\"\")","v":""},{"$f":"IFERROR('2. P&L'!AD122-('2. P&L'!AD123*('2. P&L'!AD120/'2. P&L'!AD119)+'2. P&L'!AD124*('2. P&L'!AD121/'2. P&L'!AD119)),\"\")","v":""},{"$f":"IFERROR('2. P&L'!AE122-('2. P&L'!AE123*('2. P&L'!AE120/'2. P&L'!AE119)+'2. P&L'!AE124*('2. P&L'!AE121/'2. P&L'!AE119)),\"\")","v":""},{"$f":"IFERROR('2. P&L'!AF122-('2. P&L'!AF123*('2. P&L'!AF120/'2. P&L'!AF119)+'2. P&L'!AF124*('2. P&L'!AF121/'2. P&L'!AF119)),\"\")","v":""},{"$f":"IFERROR('2. P&L'!AG122-('2. P&L'!AG123*('2. P&L'!AG120/'2. P&L'!AG119)+'2. P&L'!AG124*('2. P&L'!AG121/'2. P&L'!AG119)),\"\")","v":""},{"$f":"IFERROR('2. P&L'!AH122-('2. P&L'!AH123*('2. P&L'!AH120/'2. P&L'!AH119)+'2. P&L'!AH124*('2. P&L'!AH121/'2. P&L'!AH119)),\"\")","v":""},{"$f":"IFERROR('2. P&L'!AI122-('2. P&L'!AI123*('2. P&L'!AI120/'2. P&L'!AI119)+'2. P&L'!AI124*('2. P&L'!AI121/'2. P&L'!AI119)),\"\")","v":""},{"$f":"IFERROR('2. P&L'!AJ122-('2. P&L'!AJ123*('2. P&L'!AJ120/'2. P&L'!AJ119)+'2. P&L'!AJ124*('2. P&L'!AJ121/'2. P&L'!AJ119)),\"\")","v":""},{"$f":"IFERROR('2. P&L'!AK122-('2. P&L'!AK123*('2. P&L'!AK120/'2. P&L'!AK119)+'2. P&L'!AK124*('2. P&L'!AK121/'2. P&L'!AK119)),\"\")","v":""},{"$f":"IFERROR('2. P&L'!AL122-('2. P&L'!AL123*('2. P&L'!AL120/'2. P&L'!AL119)+'2. P&L'!AL124*('2. P&L'!AL121/'2. P&L'!AL119)),\"\")","v":""},{"$f":"IFERROR('2. P&L'!AM122-('2. P&L'!AM123*('2. P&L'!AM120/'2. P&L'!AM119)+'2. P&L'!AM124*('2. P&L'!AM121/'2. P&L'!AM119)),\"\")","v":""},{"$f":"IFERROR('2. P&L'!AN122-('2. P&L'!AN123*('2. P&L'!AN120/'2. P&L'!AN119)+'2. P&L'!AN124*('2. P&L'!AN121/'2. P&L'!AN119)),\"\")","v":""},{"$f":"IFERROR('2. P&L'!AO122-('2. P&L'!AO123*('2. P&L'!AO120/'2. P&L'!AO119)+'2. P&L'!AO124*('2. P&L'!AO121/'2. P&L'!AO119)),\"\")","v":""},{"$f":"IFERROR('2. P&L'!AP122-('2. P&L'!AP123*('2. P&L'!AP120/'2. P&L'!AP119)+'2. P&L'!AP124*('2. P&L'!AP121/'2. P&L'!AP119)),\"\")","v":""},{"$f":"IFERROR('2. P&L'!AQ122-('2. P&L'!AQ123*('2. P&L'!AQ120/'2. P&L'!AQ119)+'2. P&L'!AQ124*('2. P&L'!AQ121/'2. P&L'!AQ119)),\"\")","v":""},{"$f":"IFERROR('2. P&L'!AR122-('2. P&L'!AR123*('2. P&L'!AR120/'2. P&L'!AR119)+'2. P&L'!AR124*('2. P&L'!AR121/'2. P&L'!AR119)),\"\")","v":""},{"$f":"IFERROR('2. P&L'!AS122-('2. P&L'!AS123*('2. P&L'!AS120/'2. P&L'!AS119)+'2. P&L'!AS124*('2. P&L'!AS121/'2. P&L'!AS119)),\"\")","v":""},{"$f":"IFERROR('2. P&L'!AT122-('2. P&L'!AT123*('2. P&L'!AT120/'2. P&L'!AT119)+'2. P&L'!AT124*('2. P&L'!AT121/'2. P&L'!AT119)),\"\")","v":""},{"$f":"IFERROR('2. P&L'!AU122-('2. P&L'!AU123*('2. P&L'!AU120/'2. P&L'!AU119)+'2. P&L'!AU124*('2. P&L'!AU121/'2. P&L'!AU119)),\"\")","v":""},{"$f":"IFERROR('2. P&L'!AV122-('2. P&L'!AV123*('2. P&L'!AV120/'2. P&L'!AV119)+'2. P&L'!AV124*('2. P&L'!AV121/'2. P&L'!AV119)),\"\")","v":""},{"$f":"IFERROR('2. P&L'!AW122-('2. P&L'!AW123*('2. P&L'!AW120/'2. P&L'!AW119)+'2. P&L'!AW124*('2. P&L'!AW121/'2. P&L'!AW119)),\"\")","v":""},{"$f":"IFERROR('2. P&L'!AX122-('2. P&L'!AX123*('2. P&L'!AX120/'2. P&L'!AX119)+'2. P&L'!AX124*('2. P&L'!AX121/'2. P&L'!AX119)),\"\")","v":""},{"$f":"IFERROR('2. P&L'!AY122-('2. P&L'!AY123*('2. P&L'!AY120/'2. P&L'!AY119)+'2. P&L'!AY124*('2. P&L'!AY121/'2. P&L'!AY119)),\"\")","v":""},{"$f":"IFERROR('2. P&L'!AZ122-('2. P&L'!AZ123*('2. P&L'!AZ120/'2. P&L'!AZ119)+'2. P&L'!AZ124*('2. P&L'!AZ121/'2. P&L'!AZ119)),\"\")","v":""},{"$f":"IFERROR('2. P&L'!BA122-('2. P&L'!BA123*('2. P&L'!BA120/'2. P&L'!BA119)+'2. P&L'!BA124*('2. P&L'!BA121/'2. P&L'!BA119)),\"\")","v":""},{"$f":"IFERROR('2. P&L'!BB122-('2. P&L'!BB123*('2. P&L'!BB120/'2. P&L'!BB119)+'2. P&L'!BB124*('2. P&L'!BB121/'2. P&L'!BB119)),\"\")","v":""},{"$f":"IFERROR('2. P&L'!BC122-('2. P&L'!BC123*('2. P&L'!BC120/'2. P&L'!BC119)+'2. P&L'!BC124*('2. P&L'!BC121/'2. P&L'!BC119)),\"\")","v":""},{"$f":"IFERROR('2. P&L'!BD122-('2. P&L'!BD123*('2. P&L'!BD120/'2. P&L'!BD119)+'2. P&L'!BD124*('2. P&L'!BD121/'2. P&L'!BD119)),\"\")","v":""},{"$f":"IFERROR('2. P&L'!BE122-('2. P&L'!BE123*('2. P&L'!BE120/'2. P&L'!BE119)+'2. P&L'!BE124*('2. P&L'!BE121/'2. P&L'!BE119)),\"\")","v":""},{"$f":"IFERROR('2. P&L'!BF122-('2. P&L'!BF123*('2. P&L'!BF120/'2. P&L'!BF119)+'2. P&L'!BF124*('2. P&L'!BF121/'2. P&L'!BF119)),\"\")","v":""},{"$f":"IFERROR('2. P&L'!BG122-('2. P&L'!BG123*('2. P&L'!BG120/'2. P&L'!BG119)+'2. P&L'!BG124*('2. P&L'!BG121/'2. P&L'!BG119)),\"\")","v":""},{"$f":"IFERROR('2. P&L'!BH122-('2. P&L'!BH123*('2. P&L'!BH120/'2. P&L'!BH119)+'2. P&L'!BH124*('2. P&L'!BH121/'2. P&L'!BH119)),\"\")","v":""},{"$f":"IFERROR('2. P&L'!BI122-('2. P&L'!BI123*('2. P&L'!BI120/'2. P&L'!BI119)+'2. P&L'!BI124*('2. P&L'!BI121/'2. P&L'!BI119)),\"\")","v":""},{"$f":"IFERROR('2. P&L'!BJ122-('2. P&L'!BJ123*('2. P&L'!BJ120/'2. P&L'!BJ119)+'2. P&L'!BJ124*('2. P&L'!BJ121/'2. P&L'!BJ119)),\"\")","v":""},{"$f":"IFERROR('2. P&L'!BK122-('2. P&L'!BK123*('2. P&L'!BK120/'2. P&L'!BK119)+'2. P&L'!BK124*('2. P&L'!BK121/'2. P&L'!BK119)),\"\")","v":""},{"$f":"IFERROR('2. P&L'!BL122-('2. P&L'!BL123*('2. P&L'!BL120/'2. P&L'!BL119)+'2. P&L'!BL124*('2. P&L'!BL121/'2. P&L'!BL119)),\"\")","v":""},{"$f":"IFERROR('2. P&L'!BM122-('2. P&L'!BM123*('2. P&L'!BM120/'2. P&L'!BM119)+'2. P&L'!BM124*('2. P&L'!BM121/'2. P&L'!BM119)),\"\")","v":""},{"$f":"IFERROR('2. P&L'!BN122-('2. P&L'!BN123*('2. P&L'!BN120/'2. P&L'!BN119)+'2. P&L'!BN124*('2. P&L'!BN121/'2. P&L'!BN119)),\"\")","v":""},{"$f":"IFERROR('2. P&L'!BO122-('2. P&L'!BO123*('2. P&L'!BO120/'2. P&L'!BO119)+'2. P&L'!BO124*('2. P&L'!BO121/'2. P&L'!BO119)),\"\")","v":""},{"$f":"IFERROR('2. P&L'!BP122-('2. P&L'!BP123*('2. P&L'!BP120/'2. P&L'!BP119)+'2. P&L'!BP124*('2. P&L'!BP121/'2. P&L'!BP119)),\"\")","v":""},{"$f":"IFERROR('2. P&L'!BQ122-('2. P&L'!BQ123*('2. P&L'!BQ120/'2. P&L'!BQ119)+'2. P&L'!BQ124*('2. P&L'!BQ121/'2. P&L'!BQ119)),\"\")","v":""},{"$f":"IFERROR('2. P&L'!BR122-('2. P&L'!BR123*('2. P&L'!BR120/'2. P&L'!BR119)+'2. P&L'!BR124*('2. P&L'!BR121/'2. P&L'!BR119)),\"\")","v":""},{"$f":"IFERROR('2. P&L'!BS122-('2. P&L'!BS123*('2. P&L'!BS120/'2. P&L'!BS119)+'2. P&L'!BS124*('2. P&L'!BS121/'2. P&L'!BS119)),\"\")","v":""},{"$f":"IFERROR('2. P&L'!BT122-('2. P&L'!BT123*('2. P&L'!BT120/'2. P&L'!BT119)+'2. P&L'!BT124*('2. P&L'!BT121/'2. P&L'!BT119)),\"\")","v":""},{"$f":"IFERROR('2. P&L'!BU122-('2. P&L'!BU123*('2. P&L'!BU120/'2. P&L'!BU119)+'2. P&L'!BU124*('2. P&L'!BU121/'2. P&L'!BU119)),\"\")","v":""},{"$f":"IFERROR('2. P&L'!BV122-('2. P&L'!BV123*('2. P&L'!BV120/'2. P&L'!BV119)+'2. P&L'!BV124*('2. P&L'!BV121/'2. P&L'!BV119)),\"\")","v":""},{"$f":"IFERROR('2. P&L'!BW122-('2. P&L'!BW123*('2. P&L'!BW120/'2. P&L'!BW119)+'2. P&L'!BW124*('2. P&L'!BW121/'2. P&L'!BW119)),\"\")","v":""},{"$f":"IFERROR('2. P&L'!BX122-('2. P&L'!BX123*('2. P&L'!BX120/'2. P&L'!BX119)+'2. P&L'!BX124*('2. P&L'!BX121/'2. P&L'!BX119)),\"\")","v":""},{"$f":"IFERROR('2. P&L'!BY122-('2. P&L'!BY123*('2. P&L'!BY120/'2. P&L'!BY119)+'2. P&L'!BY124*('2. P&L'!BY121/'2. P&L'!BY119)),\"\")","v":""},{"$f":"IFERROR('2. P&L'!BZ122-('2. P&L'!BZ123*('2. P&L'!BZ120/'2. P&L'!BZ119)+'2. P&L'!BZ124*('2. P&L'!BZ121/'2. P&L'!BZ119)),\"\")","v":""},{"$f":"IFERROR('2. P&L'!CA122-('2. P&L'!CA123*('2. P&L'!CA120/'2. P&L'!CA119)+'2. P&L'!CA124*('2. P&L'!CA121/'2. P&L'!CA119)),\"\")","v":""},{"$f":"IFERROR('2. P&L'!CB122-('2. P&L'!CB123*('2. P&L'!CB120/'2. P&L'!CB119)+'2. P&L'!CB124*('2. P&L'!CB121/'2. P&L'!CB119)),\"\")","v":""}]
["Check détail par classe du CA Péage concession 2","Cohérence Evolution globale et détail de l'évolution",null,null,{"$f":"IF(ABS(SUM(F13:AB13))<(10^-2)%, \"OK\", \"CHECK\")","v":"OK"},{"$f":"IFERROR('2. P&L'!F183-('2. P&L'!F184*('2. P&L'!F181/'2. P&L'!F180)+'2. P&L'!F185*('2. P&L'!F182/'2. P&L'!F180)),\"\")","v":""},{"$f":"IFERROR('2. P&L'!G183-('2. P&L'!G184*('2. P&L'!G181/'2. P&L'!G180)+'2. P&L'!G185*('2. P&L'!G182/'2. P&L'!G180)),\"\")","v":""},{"$f":"IFERROR('2. P&L'!H183-('2. P&L'!H184*('2. P&L'!H181/'2. P&L'!H180)+'2. P&L'!H185*('2. P&L'!H182/'2. P&L'!H180)),\"\")","v":""},{"$f":"IFERROR('2. P&L'!I183-('2. P&L'!I184*('2. P&L'!I181/'2. P&L'!I180)+'2. P&L'!I185*('2. P&L'!I182/'2. P&L'!I180)),\"\")","v":""},{"$f":"IFERROR('2. P&L'!J183-('2. P&L'!J184*('2. P&L'!J181/'2. P&L'!J180)+'2. P&L'!J185*('2. P&L'!J182/'2. P&L'!J180)),\"\")","v":""},{"$f":"IFERROR('2. P&L'!K183-('2. P&L'!K184*('2. P&L'!K181/'2. P&L'!K180)+'2. P&L'!K185*('2. P&L'!K182/'2. P&L'!K180)),\"\")","v":""},{"$f":"IFERROR('2. P&L'!L183-('2. P&L'!L184*('2. P&L'!L181/'2. P&L'!L180)+'2. P&L'!L185*('2. P&L'!L182/'2. P&L'!L180)),\"\")","v":""},{"$f":"IFERROR('2. P&L'!M183-('2. P&L'!M184*('2. P&L'!M181/'2. P&L'!M180)+'2. P&L'!M185*('2. P&L'!M182/'2. P&L'!M180)),\"\")","v":""},{"$f":"IFERROR('2. P&L'!N183-('2. P&L'!N184*('2. P&L'!N181/'2. P&L'!N180)+'2. P&L'!N185*('2. P&L'!N182/'2. P&L'!N180)),\"\")","v":""},{"$f":"IFERROR('2. P&L'!O183-('2. P&L'!O184*('2. P&L'!O181/'2. P&L'!O180)+'2. P&L'!O185*('2. P&L'!O182/'2. P&L'!O180)),\"\")","v":""},{"$f":"IFERROR('2. P&L'!P183-('2. P&L'!P184*('2. P&L'!P181/'2. P&L'!P180)+'2. P&L'!P185*('2. P&L'!P182/'2. P&L'!P180)),\"\")","v":""},{"$f":"IFERROR('2. P&L'!Q183-('2. P&L'!Q184*('2. P&L'!Q181/'2. P&L'!Q180)+'2. P&L'!Q185*('2. P&L'!Q182/'2. P&L'!Q180)),\"\")","v":""},{"$f":"IFERROR('2. P&L'!R183-('2. P&L'!R184*('2. P&L'!R181/'2. P&L'!R180)+'2. P&L'!R185*('2. P&L'!R182/'2. P&L'!R180)),\"\")","v":""},{"$f":"IFERROR('2. P&L'!S183-('2. P&L'!S184*('2. P&L'!S181/'2. P&L'!S180)+'2. P&L'!S185*('2. P&L'!S182/'2. P&L'!S180)),\"\")","v":""},{"$f":"IFERROR('2. P&L'!T183-('2. P&L'!T184*('2. P&L'!T181/'2. P&L'!T180)+'2. P&L'!T185*('2. P&L'!T182/'2. P&L'!T180)),\"\")","v":""},{"$f":"IFERROR('2. P&L'!U183-('2. P&L'!U184*('2. P&L'!U181/'2. P&L'!U180)+'2. P&L'!U185*('2. P&L'!U182/'2. P&L'!U180)),\"\")","v":""},{"$f":"IFERROR('2. P&L'!V183-('2. P&L'!V184*('2. P&L'!V181/'2. P&L'!V180)+'2. P&L'!V185*('2. P&L'!V182/'2. P&L'!V180)),\"\")","v":""},{"$f":"IFERROR('2. P&L'!W183-('2. P&L'!W184*('2. P&L'!W181/'2. P&L'!W180)+'2. P&L'!W185*('2. P&L'!W182/'2. P&L'!W180)),\"\")","v":""},{"$f":"IFERROR('2. P&L'!X183-('2. P&L'!X184*('2. P&L'!X181/'2. P&L'!X180)+'2. P&L'!X185*('2. P&L'!X182/'2. P&L'!X180)),\"\")","v":""},{"$f":"IFERROR('2. P&L'!Y183-('2. P&L'!Y184*('2. P&L'!Y181/'2. P&L'!Y180)+'2. P&L'!Y185*('2. P&L'!Y182/'2. P&L'!Y180)),\"\")","v":""},{"$f":"IFERROR('2. P&L'!Z183-('2. P&L'!Z184*('2. P&L'!Z181/'2. P&L'!Z180)+'2. P&L'!Z185*('2. P&L'!Z182/'2. P&L'!Z180)),\"\")","v":""},{"$f":"IFERROR('2. P&L'!AA183-('2. P&L'!AA184*('2. P&L'!AA181/'2. P&L'!AA180)+'2. P&L'!AA185*('2. P&L'!AA182/'2. P&L'!AA180)),\"\")","v":""},{"$f":"IFERROR('2. P&L'!AB183-('2. P&L'!AB184*('2. P&L'!AB181/'2. P&L'!AB180)+'2. P&L'!AB185*('2. P&L'!AB182/'2. P&L'!AB180)),\"\")","v":""},{"$f":"IFERROR('2. P&L'!AC183-('2. P&L'!AC184*('2. P&L'!AC181/'2. P&L'!AC180)+'2. P&L'!AC185*('2. P&L'!AC182/'2. P&L'!AC180)),\"\")","v":""},{"$f":"IFERROR('2. P&L'!AD183-('2. P&L'!AD184*('2. P&L'!AD181/'2. P&L'!AD180)+'2. P&L'!AD185*('2. P&L'!AD182/'2. P&L'!AD180)),\"\")","v":""},{"$f":"IFERROR('2. P&L'!AE183-('2. P&L'!AE184*('2. P&L'!AE181/'2. P&L'!AE180)+'2. P&L'!AE185*('2. P&L'!AE182/'2. P&L'!AE180)),\"\")","v":""},{"$f":"IFERROR('2. P&L'!AF183-('2. P&L'!AF184*('2. P&L'!AF181/'2. P&L'!AF180)+'2. P&L'!AF185*('2. P&L'!AF182/'2. P&L'!AF180)),\"\")","v":""},{"$f":"IFERROR('2. P&L'!AG183-('2. P&L'!AG184*('2. P&L'!AG181/'2. P&L'!AG180)+'2. P&L'!AG185*('2. P&L'!AG182/'2. P&L'!AG180)),\"\")","v":""},{"$f":"IFERROR('2. P&L'!AH183-('2. P&L'!AH184*('2. P&L'!AH181/'2. P&L'!AH180)+'2. P&L'!AH185*('2. P&L'!AH182/'2. P&L'!AH180)),\"\")","v":""},{"$f":"IFERROR('2. P&L'!AI183-('2. P&L'!AI184*('2. P&L'!AI181/'2. P&L'!AI180)+'2. P&L'!AI185*('2. P&L'!AI182/'2. P&L'!AI180)),\"\")","v":""},{"$f":"IFERROR('2. P&L'!AJ183-('2. P&L'!AJ184*('2. P&L'!AJ181/'2. P&L'!AJ180)+'2. P&L'!AJ185*('2. P&L'!AJ182/'2. P&L'!AJ180)),\"\")","v":""},{"$f":"IFERROR('2. P&L'!AK183-('2. P&L'!AK184*('2. P&L'!AK181/'2. P&L'!AK180)+'2. P&L'!AK185*('2. P&L'!AK182/'2. P&L'!AK180)),\"\")","v":""},{"$f":"IFERROR('2. P&L'!AL183-('2. P&L'!AL184*('2. P&L'!AL181/'2. P&L'!AL180)+'2. P&L'!AL185*('2. P&L'!AL182/'2. P&L'!AL180)),\"\")","v":""},{"$f":"IFERROR('2. P&L'!AM183-('2. P&L'!AM184*('2. P&L'!AM181/'2. P&L'!AM180)+'2. P&L'!AM185*('2. P&L'!AM182/'2. P&L'!AM180)),\"\")","v":""},{"$f":"IFERROR('2. P&L'!AN183-('2. P&L'!AN184*('2. P&L'!AN181/'2. P&L'!AN180)+'2. P&L'!AN185*('2. P&L'!AN182/'2. P&L'!AN180)),\"\")","v":""},{"$f":"IFERROR('2. P&L'!AO183-('2. P&L'!AO184*('2. P&L'!AO181/'2. P&L'!AO180)+'2. P&L'!AO185*('2. P&L'!AO182/'2. P&L'!AO180)),\"\")","v":""},{"$f":"IFERROR('2. P&L'!AP183-('2. P&L'!AP184*('2. P&L'!AP181/'2. P&L'!AP180)+'2. P&L'!AP185*('2. P&L'!AP182/'2. P&L'!AP180)),\"\")","v":""},{"$f":"IFERROR('2. P&L'!AQ183-('2. P&L'!AQ184*('2. P&L'!AQ181/'2. P&L'!AQ180)+'2. P&L'!AQ185*('2. P&L'!AQ182/'2. P&L'!AQ180)),\"\")","v":""},{"$f":"IFERROR('2. P&L'!AR183-('2. P&L'!AR184*('2. P&L'!AR181/'2. P&L'!AR180)+'2. P&L'!AR185*('2. P&L'!AR182/'2. P&L'!AR180)),\"\")","v":""},{"$f":"IFERROR('2. P&L'!AS183-('2. P&L'!AS184*('2. P&L'!AS181/'2. P&L'!AS180)+'2. P&L'!AS185*('2. P&L'!AS182/'2. P&L'!AS180)),\"\")","v":""},{"$f":"IFERROR('2. P&L'!AT183-('2. P&L'!AT184*('2. P&L'!AT181/'2. P&L'!AT180)+'2. P&L'!AT185*('2. P&L'!AT182/'2. P&L'!AT180)),\"\")","v":""},{"$f":"IFERROR('2. P&L'!AU183-('2. P&L'!AU184*('2. P&L'!AU181/'2. P&L'!AU180)+'2. P&L'!AU185*('2. P&L'!AU182/'2. P&L'!AU180)),\"\")","v":""},{"$f":"IFERROR('2. P&L'!AV183-('2. P&L'!AV184*('2. P&L'!AV181/'2. P&L'!AV180)+'2. P&L'!AV185*('2. P&L'!AV182/'2. P&L'!AV180)),\"\")","v":""},{"$f":"IFERROR('2. P&L'!AW183-('2. P&L'!AW184*('2. P&L'!AW181/'2. P&L'!AW180)+'2. P&L'!AW185*('2. P&L'!AW182/'2. P&L'!AW180)),\"\")","v":""},{"$f":"IFERROR('2. P&L'!AX183-('2. P&L'!AX184*('2. P&L'!AX181/'2. P&L'!AX180)+'2. P&L'!AX185*('2. P&L'!AX182/'2. P&L'!AX180)),\"\")","v":""},{"$f":"IFERROR('2. P&L'!AY183-('2. P&L'!AY184*('2. P&L'!AY181/'2. P&L'!AY180)+'2. P&L'!AY185*('2. P&L'!AY182/'2. P&L'!AY180)),\"\")","v":""},{"$f":"IFERROR('2. P&L'!AZ183-('2. P&L'!AZ184*('2. P&L'!AZ181/'2. P&L'!AZ180)+'2. P&L'!AZ185*('2. P&L'!AZ182/'2. P&L'!AZ180)),\"\")","v":""},{"$f":"IFERROR('2. P&L'!BA183-('2. P&L'!BA184*('2. P&L'!BA181/'2. P&L'!BA180)+'2. P&L'!BA185*('2. P&L'!BA182/'2. P&L'!BA180)),\"\")","v":""},{"$f":"IFERROR('2. P&L'!BB183-('2. P&L'!BB184*('2. P&L'!BB181/'2. P&L'!BB180)+'2. P&L'!BB185*('2. P&L'!BB182/'2. P&L'!BB180)),\"\")","v":""},{"$f":"IFERROR('2. P&L'!BC183-('2. P&L'!BC184*('2. P&L'!BC181/'2. P&L'!BC180)+'2. P&L'!BC185*('2. P&L'!BC182/'2. P&L'!BC180)),\"\")","v":""},{"$f":"IFERROR('2. P&L'!BD183-('2. P&L'!BD184*('2. P&L'!BD181/'2. P&L'!BD180)+'2. P&L'!BD185*('2. P&L'!BD182/'2. P&L'!BD180)),\"\")","v":""},{"$f":"IFERROR('2. P&L'!BE183-('2. P&L'!BE184*('2. P&L'!BE181/'2. P&L'!BE180)+'2. P&L'!BE185*('2. P&L'!BE182/'2. P&L'!BE180)),\"\")","v":""},{"$f":"IFERROR('2. P&L'!BF183-('2. P&L'!BF184*('2. P&L'!BF181/'2. P&L'!BF180)+'2. P&L'!BF185*('2. P&L'!BF182/'2. P&L'!BF180)),\"\")","v":""},{"$f":"IFERROR('2. P&L'!BG183-('2. P&L'!BG184*('2. P&L'!BG181/'2. P&L'!BG180)+'2. P&L'!BG185*('2. P&L'!BG182/'2. P&L'!BG180)),\"\")","v":""},{"$f":"IFERROR('2. P&L'!BH183-('2. P&L'!BH184*('2. P&L'!BH181/'2. P&L'!BH180)+'2. P&L'!BH185*('2. P&L'!BH182/'2. P&L'!BH180)),\"\")","v":""},{"$f":"IFERROR('2. P&L'!BI183-('2. P&L'!BI184*('2. P&L'!BI181/'2. P&L'!BI180)+'2. P&L'!BI185*('2. P&L'!BI182/'2. P&L'!BI180)),\"\")","v":""},{"$f":"IFERROR('2. P&L'!BJ183-('2. P&L'!BJ184*('2. P&L'!BJ181/'2. P&L'!BJ180)+'2. P&L'!BJ185*('2. P&L'!BJ182/'2. P&L'!BJ180)),\"\")","v":""},{"$f":"IFERROR('2. P&L'!BK183-('2. P&L'!BK184*('2. P&L'!BK181/'2. P&L'!BK180)+'2. P&L'!BK185*('2. P&L'!BK182/'2. P&L'!BK180)),\"\")","v":""},{"$f":"IFERROR('2. P&L'!BL183-('2. P&L'!BL184*('2. P&L'!BL181/'2. P&L'!BL180)+'2. P&L'!BL185*('2. P&L'!BL182/'2. P&L'!BL180)),\"\")","v":""},{"$f":"IFERROR('2. P&L'!BM183-('2. P&L'!BM184*('2. P&L'!BM181/'2. P&L'!BM180)+'2. P&L'!BM185*('2. P&L'!BM182/'2. P&L'!BM180)),\"\")","v":""},{"$f":"IFERROR('2. P&L'!BN183-('2. P&L'!BN184*('2. P&L'!BN181/'2. P&L'!BN180)+'2. P&L'!BN185*('2. P&L'!BN182/'2. P&L'!BN180)),\"\")","v":""},{"$f":"IFERROR('2. P&L'!BO183-('2. P&L'!BO184*('2. P&L'!BO181/'2. P&L'!BO180)+'2. P&L'!BO185*('2. P&L'!BO182/'2. P&L'!BO180)),\"\")","v":""},{"$f":"IFERROR('2. P&L'!BP183-('2. P&L'!BP184*('2. P&L'!BP181/'2. P&L'!BP180)+'2. P&L'!BP185*('2. P&L'!BP182/'2. P&L'!BP180)),\"\")","v":""},{"$f":"IFERROR('2. P&L'!BQ183-('2. P&L'!BQ184*('2. P&L'!BQ181/'2. P&L'!BQ180)+'2. P&L'!BQ185*('2. P&L'!BQ182/'2. P&L'!BQ180)),\"\")","v":""},{"$f":"IFERROR('2. P&L'!BR183-('2. P&L'!BR184*('2. P&L'!BR181/'2. P&L'!BR180)+'2. P&L'!BR185*('2. P&L'!BR182/'2. P&L'!BR180)),\"\")","v":""},{"$f":"IFERROR('2. P&L'!BS183-('2. P&L'!BS184*('2. P&L'!BS181/'2. P&L'!BS180)+'2. P&L'!BS185*('2. P&L'!BS182/'2. P&L'!BS180)),\"\")","v":""},{"$f":"IFERROR('2. P&L'!BT183-('2. P&L'!BT184*('2. P&L'!BT181/'2. P&L'!BT180)+'2. P&L'!BT185*('2. P&L'!BT182/'2. P&L'!BT180)),\"\")","v":""},{"$f":"IFERROR('2. P&L'!BU183-('2. P&L'!BU184*('2. P&L'!BU181/'2. P&L'!BU180)+'2. P&L'!BU185*('2. P&L'!BU182/'2. P&L'!BU180)),\"\")","v":""},{"$f":"IFERROR('2. P&L'!BV183-('2. P&L'!BV184*('2. P&L'!BV181/'2. P&L'!BV180)+'2. P&L'!BV185*('2. P&L'!BV182/'2. P&L'!BV180)),\"\")","v":""},{"$f":"IFERROR('2. P&L'!BW183-('2. P&L'!BW184*('2. P&L'!BW181/'2. P&L'!BW180)+'2. P&L'!BW185*('2. P&L'!BW182/'2. P&L'!BW180)),\"\")","v":""},{"$f":"IFERROR('2. P&L'!BX183-('2. P&L'!BX184*('2. P&L'!BX181/'2. P&L'!BX180)+'2. P&L'!BX185*('2. P&L'!BX182/'2. P&L'!BX180)),\"\")","v":""},{"$f":"IFERROR('2. P&L'!BY183-('2. P&L'!BY184*('2. P&L'!BY181/'2. P&L'!BY180)+'2. P&L'!BY185*('2. P&L'!BY182/'2. P&L'!BY180)),\"\")","v":""},{"$f":"IFERROR('2. P&L'!BZ183-('2. P&L'!BZ184*('2. P&L'!BZ181/'2. P&L'!BZ180)+'2. P&L'!BZ185*('2. P&L'!BZ182/'2. P&L'!BZ180)),\"\")","v":""},{"$f":"IFERROR('2. P&L'!CA183-('2. P&L'!CA184*('2. P&L'!CA181/'2. P&L'!CA180)+'2. P&L'!CA185*('2. P&L'!CA182/'2. P&L'!CA180)),\"\")","v":""},{"$f":"IFERROR('2. P&L'!CB183-('2. P&L'!CB184*('2. P&L'!CB181/'2. P&L'!CB180)+'2. P&L'!CB185*('2. P&L'!CB182/'2. P&L'!CB180)),\"\")","v":""}]
[]
[]
["Check Sous Total Gros Entretien","Cohérence entre total et détail",null,null,{"$f":"IF(ABS(SUM(F16:AB16))<(10^-2), \"OK\", \"CHECK\")","v":"OK"},null,{"$f":"'2. P&L'!G52-SUM('2. P&L'!G53:G55)","v":0},null,{"$f":"'2. P&L'!I52-SUM('2. P&L'!I53:I55)","v":0}]
[]
["Check Sous Total Redevance Domaniale","Cohérence entre total et détail",null,null,{"$f":"IF(ABS(SUM(F18:AB18))<(10^-2), \"OK\", \"CHECK\")","v":"OK"},{"$f":"'2. P&L'!F57-SUM('2. P&L'!F58:F59)","v":0},{"$f":"'2. P&L'!G57-SUM('2. P&L'!G58:G59)","v":0},{"$f":"'2. P&L'!H57-SUM('2. P&L'!H58:H59)","v":0},{"$f":"'2. P&L'!I57-SUM('2. P&L'!I58:I59)","v":0},{"$f":"'2. P&L'!J57-SUM('2. P&L'!J58:J59)","v":0},{"$f":"'2. P&L'!K57-SUM('2. P&L'!K58:K59)","v":0},{"$f":"'2. P&L'!L57-SUM('2. P&L'!L58:L59)","v":0},{"$f":"'2. P&L'!M57-SUM('2. P&L'!M58:M59)","v":0},{"$f":"'2. P&L'!N57-SUM('2. P&L'!N58:N59)","v":0},{"$f":"'2. P&L'!O57-SUM('2. P&L'!O58:O59)","v":0},{"$f":"'2. P&L'!P57-SUM('2. P&L'!P58:P59)","v":0},{"$f":"'2. P&L'!Q57-SUM('2. P&L'!Q58:Q59)","v":0},{"$f":"'2. P&L'!R57-SUM('2. P&L'!R58:R59)","v":0},{"$f":"'2. P&L'!S57-SUM('2. P&L'!S58:S59)","v":0},{"$f":"'2. P&L'!T57-SUM('2. P&L'!T58:T59)","v":0},{"$f":"'2. P&L'!U57-SUM('2. P&L'!U58:U59)","v":0},{"$f":"'2. P&L'!V57-SUM('2. P&L'!V58:V59)","v":0},{"$f":"'2. P&L'!W57-SUM('2. P&L'!W58:W59)","v":0},{"$f":"'2. P&L'!X57-SUM('2. P&L'!X58:X59)","v":0},{"$f":"'2. P&L'!Y57-SUM('2. P&L'!Y58:Y59)","v":0},{"$f":"'2. P&L'!Z57-SUM('2. P&L'!Z58:Z59)","v":0},{"$f":"'2. P&L'!AA57-SUM('2. P&L'!AA58:AA59)","v":0},{"$f":"'2. P&L'!AB57-SUM('2. P&L'!AB58:AB59)","v":0},{"$f":"'2. P&L'!AC57-SUM('2. P&L'!AC58:AC59)","v":0},{"$f":"'2. P&L'!AD57-SUM('2. P&L'!AD58:AD59)","v":0},{"$f":"'2. P&L'!AE57-SUM('2. P&L'!AE58:AE59)","v":0},{"$f":"'2. P&L'!AF57-SUM('2. P&L'!AF58:AF59)","v":0},{"$f":"'2. P&L'!AG57-SUM('2. P&L'!AG58:AG59)","v":0},{"$f":"'2. P&L'!AH57-SUM('2. P&L'!AH58:AH59)","v":0},{"$f":"'2. P&L'!AI57-SUM('2. P&L'!AI58:AI59)","v":0},{"$f":"'2. P&L'!AJ57-SUM('2. P&L'!AJ58:AJ59)","v":0},{"$f":"'2. P&L'!AK57-SUM('2. P&L'!AK58:AK59)","v":0},{"$f":"'2. P&L'!AL57-SUM('2. P&L'!AL58:AL59)","v":0},{"$f":"'2. P&L'!AM57-SUM('2. P&L'!AM58:AM59)","v":0},{"$f":"'2. P&L'!AN57-SUM('2. P&L'!AN58:AN59)","v":0},{"$f":"'2. P&L'!AO57-SUM('2. P&L'!AO58:AO59)","v":0},{"$f":"'2. P&L'!AP57-SUM('2. P&L'!AP58:AP59)","v":0},{"$f":"'2. P&L'!AQ57-SUM('2. P&L'!AQ58:AQ59)","v":0},{"$f":"'2. P&L'!AR57-SUM('2. P&L'!AR58:AR59)","v":0},{"$f":"'2. P&L'!AS57-SUM('2. P&L'!AS58:AS59)","v":0},{"$f":"'2. P&L'!AT57-SUM('2. P&L'!AT58:AT59)","v":0},{"$f":"'2. P&L'!AU57-SUM('2. P&L'!AU58:AU59)","v":0},{"$f":"'2. P&L'!AV57-SUM('2. P&L'!AV58:AV59)","v":0},{"$f":"'2. P&L'!AW57-SUM('2. P&L'!AW58:AW59)","v":0},{"$f":"'2. P&L'!AX57-SUM('2. P&L'!AX58:AX59)","v":0},{"$f":"'2. P&L'!AY57-SUM('2. P&L'!AY58:AY59)","v":0},{"$f":"'2. P&L'!AZ57-SUM('2. P&L'!AZ58:AZ59)","v":0},{"$f":"'2. P&L'!BA57-SUM('2. P&L'!BA58:BA59)","v":0},{"$f":"'2. P&L'!BB57-SUM('2. P&L'!BB58:BB59)","v":0},{"$f":"'2. P&L'!BC57-SUM('2. P&L'!BC58:BC59)","v":0},{"$f":"'2. P&L'!BD57-SUM('2. P&L'!BD58:BD59)","v":0},{"$f":"'2. P&L'!BE57-SUM('2. P&L'!BE58:BE59)","v":0},{"$f":"'2. P&L'!BF57-SUM('2. P&L'!BF58:BF59)","v":0},{"$f":"'2. P&L'!BG57-SUM('2. P&L'!BG58:BG59)","v":0},{"$f":"'2. P&L'!BH57-SUM('2. P&L'!BH58:BH59)","v":0},{"$f":"'2. P&L'!BI57-SUM('2. P&L'!BI58:BI59)","v":0},{"$f":"'2. P&L'!BJ57-SUM('2. P&L'!BJ58:BJ59)","v":0},{"$f":"'2. P&L'!BK57-SUM('2. P&L'!BK58:BK59)","v":0},{"$f":"'2. P&L'!BL57-SUM('2. P&L'!BL58:BL59)","v":0},{"$f":"'2. P&L'!BM57-SUM('2. P&L'!BM58:BM59)","v":0},{"$f":"'2. P&L'!BN57-SUM('2. P&L'!BN58:BN59)","v":0},{"$f":"'2. P&L'!BO57-SUM('2. P&L'!BO58:BO59)","v":0},{"$f":"'2. P&L'!BP57-SUM('2. P&L'!BP58:BP59)","v":0},{"$f":"'2. P&L'!BQ57-SUM('2. P&L'!BQ58:BQ59)","v":0},{"$f":"'2. P&L'!BR57-SUM('2. P&L'!BR58:BR59)","v":0},{"$f":"'2. P&L'!BS57-SUM('2. P&L'!BS58:BS59)","v":0},{"$f":"'2. P&L'!BT57-SUM('2. P&L'!BT58:BT59)","v":0},{"$f":"'2. P&L'!BU57-SUM('2. P&L'!BU58:BU59)","v":0},{"$f":"'2. P&L'!BV57-SUM('2. P&L'!BV58:BV59)","v":0},{"$f":"'2. P&L'!BW57-SUM('2. P&L'!BW58:BW59)","v":0},{"$f":"'2. P&L'!BX57-SUM('2. P&L'!BX58:BX59)","v":0},{"$f":"'2. P&L'!BY57-SUM('2. P&L'!BY58:BY59)","v":0},{"$f":"'2. P&L'!BZ57-SUM('2. P&L'!BZ58:BZ59)","v":0},{"$f":"'2. P&L'!CA57-SUM('2. P&L'!CA58:CA59)","v":0},{"$f":"'2. P&L'!CB57-SUM('2. P&L'!CB58:CB59)","v":0}]
[]
["Check Sous Total TAT","Cohérence entre total et détail",null,null,{"$f":"IF(ABS(SUM(F20:AB20))<(10^-2), \"OK\", \"CHECK\")","v":"OK"},{"$f":"'2. P&L'!F69-SUM('2. P&L'!F70:F71)","v":0},{"$f":"'2. P&L'!G69-SUM('2. P&L'!G70:G71)","v":0},{"$f":"'2. P&L'!H69-SUM('2. P&L'!H70:H71)","v":0},{"$f":"'2. P&L'!I69-SUM('2. P&L'!I70:I71)","v":0},{"$f":"'2. P&L'!J69-SUM('2. P&L'!J70:J71)","v":0},{"$f":"'2. P&L'!K69-SUM('2. P&L'!K70:K71)","v":0},{"$f":"'2. P&L'!L69-SUM('2. P&L'!L70:L71)","v":0},{"$f":"'2. P&L'!M69-SUM('2. P&L'!M70:M71)","v":0},{"$f":"'2. P&L'!N69-SUM('2. P&L'!N70:N71)","v":0},{"$f":"'2. P&L'!O69-SUM('2. P&L'!O70:O71)","v":0},{"$f":"'2. P&L'!P69-SUM('2. P&L'!P70:P71)","v":0},{"$f":"'2. P&L'!Q69-SUM('2. P&L'!Q70:Q71)","v":0},{"$f":"'2. P&L'!R69-SUM('2. P&L'!R70:R71)","v":0},{"$f":"'2. P&L'!S69-SUM('2. P&L'!S70:S71)","v":0},{"$f":"'2. P&L'!T69-SUM('2. P&L'!T70:T71)","v":0},{"$f":"'2. P&L'!U69-SUM('2. P&L'!U70:U71)","v":0},{"$f":"'2. P&L'!V69-SUM('2. P&L'!V70:V71)","v":0},{"$f":"'2. P&L'!W69-SUM('2. P&L'!W70:W71)","v":0},{"$f":"'2. P&L'!X69-SUM('2. P&L'!X70:X71)","v":0},{"$f":"'2. P&L'!Y69-SUM('2. P&L'!Y70:Y71)","v":0},{"$f":"'2. P&L'!Z69-SUM('2. P&L'!Z70:Z71)","v":0},{"$f":"'2. P&L'!AA69-SUM('2. P&L'!AA70:AA71)","v":0},{"$f":"'2. P&L'!AB69-SUM('2. P&L'!AB70:AB71)","v":0},{"$f":"'2. P&L'!AC69-SUM('2. P&L'!AC70:AC71)","v":0},{"$f":"'2. P&L'!AD69-SUM('2. P&L'!AD70:AD71)","v":0},{"$f":"'2. P&L'!AE69-SUM('2. P&L'!AE70:AE71)","v":0},{"$f":"'2. P&L'!AF69-SUM('2. P&L'!AF70:AF71)","v":0},{"$f":"'2. P&L'!AG69-SUM('2. P&L'!AG70:AG71)","v":0},{"$f":"'2. P&L'!AH69-SUM('2. P&L'!AH70:AH71)","v":0},{"$f":"'2. P&L'!AI69-SUM('2. P&L'!AI70:AI71)","v":0},{"$f":"'2. P&L'!AJ69-SUM('2. P&L'!AJ70:AJ71)","v":0},{"$f":"'2. P&L'!AK69-SUM('2. P&L'!AK70:AK71)","v":0},{"$f":"'2. P&L'!AL69-SUM('2. P&L'!AL70:AL71)","v":0},{"$f":"'2. P&L'!AM69-SUM('2. P&L'!AM70:AM71)","v":0},{"$f":"'2. P&L'!AN69-SUM('2. P&L'!AN70:AN71)","v":0},{"$f":"'2. P&L'!AO69-SUM('2. P&L'!AO70:AO71)","v":0},{"$f":"'2. P&L'!AP69-SUM('2. P&L'!AP70:AP71)","v":0},{"$f":"'2. P&L'!AQ69-SUM('2. P&L'!AQ70:AQ71)","v":0},{"$f":"'2. P&L'!AR69-SUM('2. P&L'!AR70:AR71)","v":0},{"$f":"'2. P&L'!AS69-SUM('2. P&L'!AS70:AS71)","v":0},{"$f":"'2. P&L'!AT69-SUM('2. P&L'!AT70:AT71)","v":0},{"$f":"'2. P&L'!AU69-SUM('2. P&L'!AU70:AU71)","v":0},{"$f":"'2. P&L'!AV69-SUM('2. P&L'!AV70:AV71)","v":0},{"$f":"'2. P&L'!AW69-SUM('2. P&L'!AW70:AW71)","v":0},{"$f":"'2. P&L'!AX69-SUM('2. P&L'!AX70:AX71)","v":0},{"$f":"'2. P&L'!AY69-SUM('2. P&L'!AY70:AY71)","v":0},{"$f":"'2. P&L'!AZ69-SUM('2. P&L'!AZ70:AZ71)","v":0},{"$f":"'2. P&L'!BA69-SUM('2. P&L'!BA70:BA71)","v":0},{"$f":"'2. P&L'!BB69-SUM('2. P&L'!BB70:BB71)","v":0},{"$f":"'2. P&L'!BC69-SUM('2. P&L'!BC70:BC71)","v":0},{"$f":"'2. P&L'!BD69-SUM('2. P&L'!BD70:BD71)","v":0},{"$f":"'2. P&L'!BE69-SUM('2. P&L'!BE70:BE71)","v":0},{"$f":"'2. P&L'!BF69-SUM('2. P&L'!BF70:BF71)","v":0},{"$f":"'2. P&L'!BG69-SUM('2. P&L'!BG70:BG71)","v":0},{"$f":"'2. P&L'!BH69-SUM('2. P&L'!BH70:BH71)","v":0},{"$f":"'2. P&L'!BI69-SUM('2. P&L'!BI70:BI71)","v":0},{"$f":"'2. P&L'!BJ69-SUM('2. P&L'!BJ70:BJ71)","v":0},{"$f":"'2. P&L'!BK69-SUM('2. P&L'!BK70:BK71)","v":0},{"$f":"'2. P&L'!BL69-SUM('2. P&L'!BL70:BL71)","v":0},{"$f":"'2. P&L'!BM69-SUM('2. P&L'!BM70:BM71)","v":0},{"$f":"'2. P&L'!BN69-SUM('2. P&L'!BN70:BN71)","v":0},{"$f":"'2. P&L'!BO69-SUM('2. P&L'!BO70:BO71)","v":0},{"$f":"'2. P&L'!BP69-SUM('2. P&L'!BP70:BP71)","v":0},{"$f":"'2. P&L'!BQ69-SUM('2. P&L'!BQ70:BQ71)","v":0},{"$f":"'2. P&L'!BR69-SUM('2. P&L'!BR70:BR71)","v":0},{"$f":"'2. P&L'!BS69-SUM('2. P&L'!BS70:BS71)","v":0},{"$f":"'2. P&L'!BT69-SUM('2. P&L'!BT70:BT71)","v":0},{"$f":"'2. P&L'!BU69-SUM('2. P&L'!BU70:BU71)","v":0},{"$f":"'2. P&L'!BV69-SUM('2. P&L'!BV70:BV71)","v":0},{"$f":"'2. P&L'!BW69-SUM('2. P&L'!BW70:BW71)","v":0},{"$f":"'2. P&L'!BX69-SUM('2. P&L'!BX70:BX71)","v":0},{"$f":"'2. P&L'!BY69-SUM('2. P&L'!BY70:BY71)","v":0},{"$f":"'2. P&L'!BZ69-SUM('2. P&L'!BZ70:BZ71)","v":0},{"$f":"'2. P&L'!CA69-SUM('2. P&L'!CA70:CA71)","v":0},{"$f":"'2. P&L'!CB69-SUM('2. P&L'!CB70:CB71)","v":0}]
[]
["Check Sous Total Autres dotations aux amort. et prov.","Cohérence entre total et détail",null,null,{"$f":"IF(ABS(SUM(F22:AB22))<(10^-2), \"OK\", \"CHECK\")","v":"OK"},null,{"$f":"'2. P&L'!G81-SUM('2. P&L'!G82:G85)","v":0},null,{"$f":"'2. P&L'!I81-SUM('2. P&L'!I82:I85)","v":0}]
[]
[]
["Checks Cash Flow"]
[]
["Check Investissements","Cohérence entre les montants d'investissements prévisionnels inscrit dans le tableau de Cash Flow et le Pg d'investissements",null,null,{"$f":"IF(ABS(SUM(F27:AB27))<10^-2, \"OK\", \"CHECK\")","v":"OK"},null,null,null,null,{"$f":"'3. CF'!J13+'5. Investissements'!J96","v":0},{"$f":"'3. CF'!K13+'5. Investissements'!K96","v":0},{"$f":"'3. CF'!L13+'5. Investissements'!L96","v":0},{"$f":"'3. CF'!M13+'5. Investissements'!M96","v":0},{"$f":"'3. CF'!N13+'5. Investissements'!N96","v":0},{"$f":"'3. CF'!O13+'5. Investissements'!O96","v":0},{"$f":"'3. CF'!P13+'5. Investissements'!P96","v":0},{"$f":"'3. CF'!Q13+'5. Investissements'!Q96","v":0},{"$f":"'3. CF'!R13+'5. Investissements'!R96","v":0},{"$f":"'3. CF'!S13+'5. Investissements'!S96","v":0},{"$f":"'3. CF'!T13+'5. Investissements'!T96","v":0},{"$f":"'3. CF'!U13+'5. Investissements'!U96","v":0},{"$f":"'3. CF'!V13+'5. Investissements'!V96","v":0},{"$f":"'3. CF'!W13+'5. Investissements'!W96","v":0},{"$f":"'3. CF'!X13+'5. Investissements'!X96","v":0},{"$f":"'3. CF'!Y13+'5. Investissements'!Y96","v":0},{"$f":"'3. CF'!Z13+'5. Investissements'!Z96","v":0},{"$f":"'3. CF'!AA13+'5. Investissements'!AA96","v":0},{"$f":"'3. CF'!AB13+'5. Investissements'!AB96","v":0},{"$f":"'3. CF'!AC13+'5. Investissements'!AC96","v":0},{"$f":"'3. CF'!AD13+'5. Investissements'!AD96","v":0},{"$f":"'3. CF'!AE13+'5. Investissements'!AE96","v":0},{"$f":"'3. CF'!AF13+'5. Investissements'!AF96","v":0},{"$f":"'3. CF'!AG13+'5. Investissements'!AG96","v":0},{"$f":"'3. CF'!AH13+'5. Investissements'!AH96","v":0},{"$f":"'3. CF'!AI13+'5. Investissements'!AI96","v":0},{"$f":"'3. CF'!AJ13+'5. Investissements'!AJ96","v":0},{"$f":"'3. CF'!AK13+'5. Investissements'!AK96","v":0},{"$f":"'3. CF'!AL13+'5. Investissements'!AL96","v":0},{"$f":"'3. CF'!AM13+'5. Investissements'!AM96","v":0},{"$f":"'3. CF'!AN13+'5. Investissements'!AN96","v":0},{"$f":"'3. CF'!AO13+'5. Investissements'!AO96","v":0},{"$f":"'3. CF'!AP13+'5. Investissements'!AP96","v":0},{"$f":"'3. CF'!AQ13+'5. Investissements'!AQ96","v":0},{"$f":"'3. CF'!AR13+'5. Investissements'!AR96","v":0},{"$f":"'3. CF'!AS13+'5. Investissements'!AS96","v":0},{"$f":"'3. CF'!AT13+'5. Investissements'!AT96","v":0},{"$f":"'3. CF'!AU13+'5. Investissements'!AU96","v":0},{"$f":"'3. CF'!AV13+'5. Investissements'!AV96","v":0},{"$f":"'3. CF'!AW13+'5. Investissements'!AW96","v":0},{"$f":"'3. CF'!AX13+'5. Investissements'!AX96","v":0},{"$f":"'3. CF'!AY13+'5. Investissements'!AY96","v":0},{"$f":"'3. CF'!AZ13+'5. Investissements'!AZ96","v":0},{"$f":"'3. CF'!BA13+'5. Investissements'!BA96","v":0},{"$f":"'3. CF'!BB13+'5. Investissements'!BB96","v":0},{"$f":"'3. CF'!BC13+'5. Investissements'!BC96","v":0},{"$f":"'3. CF'!BD13+'5. Investissements'!BD96","v":0},{"$f":"'3. CF'!BE13+'5. Investissements'!BE96","v":0},{"$f":"'3. CF'!BF13+'5. Investissements'!BF96","v":0},{"$f":"'3. CF'!BG13+'5. Investissements'!BG96","v":0},{"$f":"'3. CF'!BH13+'5. Investissements'!BH96","v":0},{"$f":"'3. CF'!BI13+'5. Investissements'!BI96","v":0},{"$f":"'3. CF'!BJ13+'5. Investissements'!BJ96","v":0},{"$f":"'3. CF'!BK13+'5. Investissements'!BK96","v":0},{"$f":"'3. CF'!BL13+'5. Investissements'!BL96","v":0},{"$f":"'3. CF'!BM13+'5. Investissements'!BM96","v":0},{"$f":"'3. CF'!BN13+'5. Investissements'!BN96","v":0},{"$f":"'3. CF'!BO13+'5. Investissements'!BO96","v":0},{"$f":"'3. CF'!BP13+'5. Investissements'!BP96","v":0},{"$f":"'3. CF'!BQ13+'5. Investissements'!BQ96","v":0},{"$f":"'3. CF'!BR13+'5. Investissements'!BR96","v":0},{"$f":"'3. CF'!BS13+'5. Investissements'!BS96","v":0},{"$f":"'3. CF'!BT13+'5. Investissements'!BT96","v":0},{"$f":"'3. CF'!BU13+'5. Investissements'!BU96","v":0},{"$f":"'3. CF'!BV13+'5. Investissements'!BV96","v":0},{"$f":"'3. CF'!BW13+'5. Investissements'!BW96","v":0},{"$f":"'3. CF'!BX13+'5. Investissements'!BX96","v":0},{"$f":"'3. CF'!BY13+'5. Investissements'!BY96","v":0},{"$f":"'3. CF'!BZ13+'5. Investissements'!BZ96","v":0},{"$f":"'3. CF'!CA13+'5. Investissements'!CA96","v":0},{"$f":"'3. CF'!CB13+'5. Investissements'!CB96","v":0}]
[]
["Check Cumul Trésorerie >= 0 chaque année","Vérification que le cumul de Trésorerie à chaque fin d'exercice est positif ou nul.\nSi le cumul de trésorerie est négatif, indicateur à 1.",null,null,{"$f":"IF(SUM(F29:AB29)=0, \"OK\", \"CHECK\")","v":"OK"},{"$f":"IF('3. CF'!F33>=0,0,1)","v":0},{"$f":"IF('3. CF'!G33>=0,0,1)","v":0},{"$f":"IF('3. CF'!H33>=0,0,1)","v":0},{"$f":"IF('3. CF'!I33>=0,0,1)","v":0},{"$f":"IF('3. CF'!J33>=0,0,1)","v":0},{"$f":"IF('3. CF'!K33>=0,0,1)","v":0},{"$f":"IF('3. CF'!L33>=0,0,1)","v":0},{"$f":"IF('3. CF'!M33>=0,0,1)","v":0},{"$f":"IF('3. CF'!N33>=0,0,1)","v":0},{"$f":"IF('3. CF'!O33>=0,0,1)","v":0},{"$f":"IF('3. CF'!P33>=0,0,1)","v":0},{"$f":"IF('3. CF'!Q33>=0,0,1)","v":0},{"$f":"IF('3. CF'!R33>=0,0,1)","v":0},{"$f":"IF('3. CF'!S33>=0,0,1)","v":0},{"$f":"IF('3. CF'!T33>=0,0,1)","v":0},{"$f":"IF('3. CF'!U33>=0,0,1)","v":0},{"$f":"IF('3. CF'!V33>=0,0,1)","v":0},{"$f":"IF('3. CF'!W33>=0,0,1)","v":0},{"$f":"IF('3. CF'!X33>=0,0,1)","v":0},{"$f":"IF('3. CF'!Y33>=0,0,1)","v":0},{"$f":"IF('3. CF'!Z33>=0,0,1)","v":0},{"$f":"IF('3. CF'!AA33>=0,0,1)","v":0},{"$f":"IF('3. CF'!AB33>=0,0,1)","v":0},{"$f":"IF('3. CF'!AC33>=0,0,1)","v":0},{"$f":"IF('3. CF'!AD33>=0,0,1)","v":0},{"$f":"IF('3. CF'!AE33>=0,0,1)","v":0},{"$f":"IF('3. CF'!AF33>=0,0,1)","v":0},{"$f":"IF('3. CF'!AG33>=0,0,1)","v":0},{"$f":"IF('3. CF'!AH33>=0,0,1)","v":0},{"$f":"IF('3. CF'!AI33>=0,0,1)","v":0},{"$f":"IF('3. CF'!AJ33>=0,0,1)","v":0},{"$f":"IF('3. CF'!AK33>=0,0,1)","v":0},{"$f":"IF('3. CF'!AL33>=0,0,1)","v":0},{"$f":"IF('3. CF'!AM33>=0,0,1)","v":0},{"$f":"IF('3. CF'!AN33>=0,0,1)","v":0},{"$f":"IF('3. CF'!AO33>=0,0,1)","v":0},{"$f":"IF('3. CF'!AP33>=0,0,1)","v":0},{"$f":"IF('3. CF'!AQ33>=0,0,1)","v":0},{"$f":"IF('3. CF'!AR33>=0,0,1)","v":0},{"$f":"IF('3. CF'!AS33>=0,0,1)","v":0},{"$f":"IF('3. CF'!AT33>=0,0,1)","v":0},{"$f":"IF('3. CF'!AU33>=0,0,1)","v":0},{"$f":"IF('3. CF'!AV33>=0,0,1)","v":0},{"$f":"IF('3. CF'!AW33>=0,0,1)","v":0},{"$f":"IF('3. CF'!AX33>=0,0,1)","v":0},{"$f":"IF('3. CF'!AY33>=0,0,1)","v":0},{"$f":"IF('3. CF'!AZ33>=0,0,1)","v":0},{"$f":"IF('3. CF'!BA33>=0,0,1)","v":0},{"$f":"IF('3. CF'!BB33>=0,0,1)","v":0},{"$f":"IF('3. CF'!BC33>=0,0,1)","v":0},{"$f":"IF('3. CF'!BD33>=0,0,1)","v":0},{"$f":"IF('3. CF'!BE33>=0,0,1)","v":0},{"$f":"IF('3. CF'!BF33>=0,0,1)","v":0},{"$f":"IF('3. CF'!BG33>=0,0,1)","v":0},{"$f":"IF('3. CF'!BH33>=0,0,1)","v":0},{"$f":"IF('3. CF'!BI33>=0,0,1)","v":0},{"$f":"IF('3. CF'!BJ33>=0,0,1)","v":0},{"$f":"IF('3. CF'!BK33>=0,0,1)","v":0},{"$f":"IF('3. CF'!BL33>=0,0,1)","v":0},{"$f":"IF('3. CF'!BM33>=0,0,1)","v":0},{"$f":"IF('3. CF'!BN33>=0,0,1)","v":0},{"$f":"IF('3. CF'!BO33>=0,0,1)","v":0},{"$f":"IF('3. CF'!BP33>=0,0,1)","v":0},{"$f":"IF('3. CF'!BQ33>=0,0,1)","v":0},{"$f":"IF('3. CF'!BR33>=0,0,1)","v":0},{"$f":"IF('3. CF'!BS33>=0,0,1)","v":0},{"$f":"IF('3. CF'!BT33>=0,0,1)","v":0},{"$f":"IF('3. CF'!BU33>=0,0,1)","v":0},{"$f":"IF('3. CF'!BV33>=0,0,1)","v":0},{"$f":"IF('3. CF'!BW33>=0,0,1)","v":0},{"$f":"IF('3. CF'!BX33>=0,0,1)","v":0},{"$f":"IF('3. CF'!BY33>=0,0,1)","v":0},{"$f":"IF('3. CF'!BZ33>=0,0,1)","v":0},{"$f":"IF('3. CF'!CA33>=0,0,1)","v":0},{"$f":"IF('3. CF'!CB33>=0,0,1)","v":0}]
[]
[]
["Check Bilan"]
[]
["Check sous total immobilisations financières","Cohérence entre total et détail",null,null,{"$f":"IF(ABS(SUM(F34:AB34))<(10^-2), \"OK\", \"CHECK\")","v":"OK"},null,{"$f":"'4. Bilan & ratios'!G10-SUM('4. Bilan & ratios'!G11:G15)","v":0},null,{"$f":"'4. Bilan & ratios'!I10-SUM('4. Bilan & ratios'!I11:I15)","v":0}]
[]
["Check sous total provisions pour risques et charges","Cohérence entre total et détail",null,null,{"$f":"IF(ABS(SUM(F36:AB36))<(10^-2), \"OK\", \"CHECK\")","v":"OK"},null,{"$f":"'4. Bilan & ratios'!G35-SUM('4. Bilan & ratios'!G36:G39)","v":0},null,{"$f":"'4. Bilan & ratios'!I35-SUM('4. Bilan & ratios'!I36:I39)","v":0}]
[]
["Check sous total emprunts et dettes financières","Cohérence entre total et détail",null,null,{"$f":"IF(ABS(SUM(F38:AB38))<(10^-2), \"OK\", \"CHECK\")","v":"OK"},null,{"$f":"'4. Bilan & ratios'!G40-SUM('4. Bilan & ratios'!G41:G48)","v":0},null,{"$f":"'4. Bilan & ratios'!I40-SUM('4. Bilan & ratios'!I41:I48)","v":0}]
[]
["Check équilibre du bilan","Actif = Passif",null,null,{"$f":"IF(ABS(SUM(F40:AB40))<10^-2, \"OK\", \"CHECK\")","v":"OK"},{"$f":"'4. Bilan & ratios'!F5-'4. Bilan & ratios'!F25","v":0},{"$f":"'4. Bilan & ratios'!G5-'4. Bilan & ratios'!G25","v":0},{"$f":"'4. Bilan & ratios'!H5-'4. Bilan & ratios'!H25","v":0},{"$f":"'4. Bilan & ratios'!I5-'4. Bilan & ratios'!I25","v":0},{"$f":"'4. Bilan & ratios'!J5-'4. Bilan & ratios'!J25","v":0},{"$f":"'4. Bilan & ratios'!K5-'4. Bilan & ratios'!K25","v":0},{"$f":"'4. Bilan & ratios'!L5-'4. Bilan & ratios'!L25","v":0},{"$f":"'4. Bilan & ratios'!M5-'4. Bilan & ratios'!M25","v":0},{"$f":"'4. Bilan & ratios'!N5-'4. Bilan & ratios'!N25","v":0},{"$f":"'4. Bilan & ratios'!O5-'4. Bilan & ratios'!O25","v":0},{"$f":"'4. Bilan & ratios'!P5-'4. Bilan & ratios'!P25","v":0},{"$f":"'4. Bilan & ratios'!Q5-'4. Bilan & ratios'!Q25","v":0},{"$f":"'4. Bilan & ratios'!R5-'4. Bilan & ratios'!R25","v":0},{"$f":"'4. Bilan & ratios'!S5-'4. Bilan & ratios'!S25","v":0},{"$f":"'4. Bilan & ratios'!T5-'4. Bilan & ratios'!T25","v":0},{"$f":"'4. Bilan & ratios'!U5-'4. Bilan & ratios'!U25","v":0},{"$f":"'4. Bilan & ratios'!V5-'4. Bilan & ratios'!V25","v":0},{"$f":"'4. Bilan & ratios'!W5-'4. Bilan & ratios'!W25","v":0},{"$f":"'4. Bilan & ratios'!X5-'4. Bilan & ratios'!X25","v":0},{"$f":"'4. Bilan & ratios'!Y5-'4. Bilan & ratios'!Y25","v":0},{"$f":"'4. Bilan & ratios'!Z5-'4. Bilan & ratios'!Z25","v":0},{"$f":"'4. Bilan & ratios'!AA5-'4. Bilan & ratios'!AA25","v":0},{"$f":"'4. Bilan & ratios'!AB5-'4. Bilan & ratios'!AB25","v":0},{"$f":"'4. Bilan & ratios'!AC5-'4. Bilan & ratios'!AC25","v":0},{"$f":"'4. Bilan & ratios'!AD5-'4. Bilan & ratios'!AD25","v":0},{"$f":"'4. Bilan & ratios'!AE5-'4. Bilan & ratios'!AE25","v":0},{"$f":"'4. Bilan & ratios'!AF5-'4. Bilan & ratios'!AF25","v":0},{"$f":"'4. Bilan & ratios'!AG5-'4. Bilan & ratios'!AG25","v":0},{"$f":"'4. Bilan & ratios'!AH5-'4. Bilan & ratios'!AH25","v":0},{"$f":"'4. Bilan & ratios'!AI5-'4. Bilan & ratios'!AI25","v":0},{"$f":"'4. Bilan & ratios'!AJ5-'4. Bilan & ratios'!AJ25","v":0},{"$f":"'4. Bilan & ratios'!AK5-'4. Bilan & ratios'!AK25","v":0},{"$f":"'4. Bilan & ratios'!AL5-'4. Bilan & ratios'!AL25","v":0},{"$f":"'4. Bilan & ratios'!AM5-'4. Bilan & ratios'!AM25","v":0},{"$f":"'4. Bilan & ratios'!AN5-'4. Bilan & ratios'!AN25","v":0},{"$f":"'4. Bilan & ratios'!AO5-'4. Bilan & ratios'!AO25","v":0},{"$f":"'4. Bilan & ratios'!AP5-'4. Bilan & ratios'!AP25","v":0},{"$f":"'4. Bilan & ratios'!AQ5-'4. Bilan & ratios'!AQ25","v":0},{"$f":"'4. Bilan & ratios'!AR5-'4. Bilan & ratios'!AR25","v":0},{"$f":"'4. Bilan & ratios'!AS5-'4. Bilan & ratios'!AS25","v":0},{"$f":"'4. Bilan & ratios'!AT5-'4. Bilan & ratios'!AT25","v":0},{"$f":"'4. Bilan & ratios'!AU5-'4. Bilan & ratios'!AU25","v":0},{"$f":"'4. Bilan & ratios'!AV5-'4. Bilan & ratios'!AV25","v":0},{"$f":"'4. Bilan & ratios'!AW5-'4. Bilan & ratios'!AW25","v":0},{"$f":"'4. Bilan & ratios'!AX5-'4. Bilan & ratios'!AX25","v":0},{"$f":"'4. Bilan & ratios'!AY5-'4. Bilan & ratios'!AY25","v":0},{"$f":"'4. Bilan & ratios'!AZ5-'4. Bilan & ratios'!AZ25","v":0},{"$f":"'4. Bilan & ratios'!BA5-'4. Bilan & ratios'!BA25","v":0},{"$f":"'4. Bilan & ratios'!BB5-'4. Bilan & ratios'!BB25","v":0},{"$f":"'4. Bilan & ratios'!BC5-'4. Bilan & ratios'!BC25","v":0},{"$f":"'4. Bilan & ratios'!BD5-'4. Bilan & ratios'!BD25","v":0},{"$f":"'4. Bilan & ratios'!BE5-'4. Bilan & ratios'!BE25","v":0},{"$f":"'4. Bilan & ratios'!BF5-'4. Bilan & ratios'!BF25","v":0},{"$f":"'4. Bilan & ratios'!BG5-'4. Bilan & ratios'!BG25","v":0},{"$f":"'4. Bilan & ratios'!BH5-'4. Bilan & ratios'!BH25","v":0},{"$f":"'4. Bilan & ratios'!BI5-'4. Bilan & ratios'!BI25","v":0},{"$f":"'4. Bilan & ratios'!BJ5-'4. Bilan & ratios'!BJ25","v":0},{"$f":"'4. Bilan & ratios'!BK5-'4. Bilan & ratios'!BK25","v":0},{"$f":"'4. Bilan & ratios'!BL5-'4. Bilan & ratios'!BL25","v":0},{"$f":"'4. Bilan & ratios'!BM5-'4. Bilan & ratios'!BM25","v":0},{"$f":"'4. Bilan & ratios'!BN5-'4. Bilan & ratios'!BN25","v":0},{"$f":"'4. Bilan & ratios'!BO5-'4. Bilan & ratios'!BO25","v":0},{"$f":"'4. Bilan & ratios'!BP5-'4. Bilan & ratios'!BP25","v":0},{"$f":"'4. Bilan & ratios'!BQ5-'4. Bilan & ratios'!BQ25","v":0},{"$f":"'4. Bilan & ratios'!BR5-'4. Bilan & ratios'!BR25","v":0},{"$f":"'4. Bilan & ratios'!BS5-'4. Bilan & ratios'!BS25","v":0},{"$f":"'4. Bilan & ratios'!BT5-'4. Bilan & ratios'!BT25","v":0},{"$f":"'4. Bilan & ratios'!BU5-'4. Bilan & ratios'!BU25","v":0},{"$f":"'4. Bilan & ratios'!BV5-'4. Bilan & ratios'!BV25","v":0},{"$f":"'4. Bilan & ratios'!BW5-'4. Bilan & ratios'!BW25","v":0},{"$f":"'4. Bilan & ratios'!BX5-'4. Bilan & ratios'!BX25","v":0},{"$f":"'4. Bilan & ratios'!BY5-'4. Bilan & ratios'!BY25","v":0},{"$f":"'4. Bilan & ratios'!BZ5-'4. Bilan & ratios'!BZ25","v":0},{"$f":"'4. Bilan & ratios'!CA5-'4. Bilan & ratios'!CA25","v":0},{"$f":"'4. Bilan & ratios'!CB5-'4. Bilan & ratios'!CB25","v":0}]
[]
["Check VNC immobilisations coporelles = 0","Vérification que l'actif corporel du domaine concédé est intégralement amorti en fin de concession",null,null,{"$f":"IF(SUM(F42:AB42)=1, \"OK\", \"CHECK\")","v":"CHECK"},{"$f":"IF(AND('2. P&L'!F78<0,('4. Bilan & ratios'!F8+'4. Bilan & ratios'!F9)=0),1,0)","v":0},{"$f":"IF(AND('2. P&L'!G78<0,('4. Bilan & ratios'!G8+'4. Bilan & ratios'!G9)=0),1,0)","v":0},{"$f":"IF(AND('2. P&L'!H78<0,('4. Bilan & ratios'!H8+'4. Bilan & ratios'!H9)=0),1,0)","v":0},{"$f":"IF(AND('2. P&L'!I78<0,('4. Bilan & ratios'!I8+'4. Bilan & ratios'!I9)=0),1,0)","v":0},{"$f":"IF(AND('2. P&L'!J78<0,('4. Bilan & ratios'!J8+'4. Bilan & ratios'!J9)=0),1,0)","v":0},{"$f":"IF(AND('2. P&L'!K78<0,('4. Bilan & ratios'!K8+'4. Bilan & ratios'!K9)=0),1,0)","v":0},{"$f":"IF(AND('2. P&L'!L78<0,('4. Bilan & ratios'!L8+'4. Bilan & ratios'!L9)=0),1,0)","v":0},{"$f":"IF(AND('2. P&L'!M78<0,('4. Bilan & ratios'!M8+'4. Bilan & ratios'!M9)=0),1,0)","v":0},{"$f":"IF(AND('2. P&L'!N78<0,('4. Bilan & ratios'!N8+'4. Bilan & ratios'!N9)=0),1,0)","v":0},{"$f":"IF(AND('2. P&L'!O78<0,('4. Bilan & ratios'!O8+'4. Bilan & ratios'!O9)=0),1,0)","v":0},{"$f":"IF(AND('2. P&L'!P78<0,('4. Bilan & ratios'!P8+'4. Bilan & ratios'!P9)=0),1,0)","v":0},{"$f":"IF(AND('2. P&L'!Q78<0,('4. Bilan & ratios'!Q8+'4. Bilan & ratios'!Q9)=0),1,0)","v":0},{"$f":"IF(AND('2. P&L'!R78<0,('4. Bilan & ratios'!R8+'4. Bilan & ratios'!R9)=0),1,0)","v":0},{"$f":"IF(AND('2. P&L'!S78<0,('4. Bilan & ratios'!S8+'4. Bilan & ratios'!S9)=0),1,0)","v":0},{"$f":"IF(AND('2. P&L'!T78<0,('4. Bilan & ratios'!T8+'4. Bilan & ratios'!T9)=0),1,0)","v":0},{"$f":"IF(AND('2. P&L'!U78<0,('4. Bilan & ratios'!U8+'4. Bilan & ratios'!U9)=0),1,0)","v":0},{"$f":"IF(AND('2. P&L'!V78<0,('4. Bilan & ratios'!V8+'4. Bilan & ratios'!V9)=0),1,0)","v":0},{"$f":"IF(AND('2. P&L'!W78<0,('4. Bilan & ratios'!W8+'4. Bilan & ratios'!W9)=0),1,0)","v":0},{"$f":"IF(AND('2. P&L'!X78<0,('4. Bilan & ratios'!X8+'4. Bilan & ratios'!X9)=0),1,0)","v":0},{"$f":"IF(AND('2. P&L'!Y78<0,('4. Bilan & ratios'!Y8+'4. Bilan & ratios'!Y9)=0),1,0)","v":0},{"$f":"IF(AND('2. P&L'!Z78<0,('4. Bilan & ratios'!Z8+'4. Bilan & ratios'!Z9)=0),1,0)","v":0},{"$f":"IF(AND('2. P&L'!AA78<0,('4. Bilan & ratios'!AA8+'4. Bilan & ratios'!AA9)=0),1,0)","v":0},{"$f":"IF(AND('2. P&L'!AB78<0,('4. Bilan & ratios'!AB8+'4. Bilan & ratios'!AB9)=0),1,0)","v":0},{"$f":"IF(AND('2. P&L'!AC78<0,('4. Bilan & ratios'!AC8+'4. Bilan & ratios'!AC9)=0),1,0)","v":0},{"$f":"IF(AND('2. P&L'!AD78<0,('4. Bilan & ratios'!AD8+'4. Bilan & ratios'!AD9)=0),1,0)","v":0},{"$f":"IF(AND('2. P&L'!AE78<0,('4. Bilan & ratios'!AE8+'4. Bilan & ratios'!AE9)=0),1,0)","v":0},{"$f":"IF(AND('2. P&L'!AF78<0,('4. Bilan & ratios'!AF8+'4. Bilan & ratios'!AF9)=0),1,0)","v":0},{"$f":"IF(AND('2. P&L'!AG78<0,('4. Bilan & ratios'!AG8+'4. Bilan & ratios'!AG9)=0),1,0)","v":0},{"$f":"IF(AND('2. P&L'!AH78<0,('4. Bilan & ratios'!AH8+'4. Bilan & ratios'!AH9)=0),1,0)","v":0},{"$f":"IF(AND('2. P&L'!AI78<0,('4. Bilan & ratios'!AI8+'4. Bilan & ratios'!AI9)=0),1,0)","v":0},{"$f":"IF(AND('2. P&L'!AJ78<0,('4. Bilan & ratios'!AJ8+'4. Bilan & ratios'!AJ9)=0),1,0)","v":0},{"$f":"IF(AND('2. P&L'!AK78<0,('4. Bilan & ratios'!AK8+'4. Bilan & ratios'!AK9)=0),1,0)","v":0},{"$f":"IF(AND('2. P&L'!AL78<0,('4. Bilan & ratios'!AL8+'4. Bilan & ratios'!AL9)=0),1,0)","v":0},{"$f":"IF(AND('2. P&L'!AM78<0,('4. Bilan & ratios'!AM8+'4. Bilan & ratios'!AM9)=0),1,0)","v":0},{"$f":"IF(AND('2. P&L'!AN78<0,('4. Bilan & ratios'!AN8+'4. Bilan & ratios'!AN9)=0),1,0)","v":0},{"$f":"IF(AND('2. P&L'!AO78<0,('4. Bilan & ratios'!AO8+'4. Bilan & ratios'!AO9)=0),1,0)","v":0},{"$f":"IF(AND('2. P&L'!AP78<0,('4. Bilan & ratios'!AP8+'4. Bilan & ratios'!AP9)=0),1,0)","v":0},{"$f":"IF(AND('2. P&L'!AQ78<0,('4. Bilan & ratios'!AQ8+'4. Bilan & ratios'!AQ9)=0),1,0)","v":0},{"$f":"IF(AND('2. P&L'!AR78<0,('4. Bilan & ratios'!AR8+'4. Bilan & ratios'!AR9)=0),1,0)","v":0},{"$f":"IF(AND('2. P&L'!AS78<0,('4. Bilan & ratios'!AS8+'4. Bilan & ratios'!AS9)=0),1,0)","v":0},{"$f":"IF(AND('2. P&L'!AT78<0,('4. Bilan & ratios'!AT8+'4. Bilan & ratios'!AT9)=0),1,0)","v":0},{"$f":"IF(AND('2. P&L'!AU78<0,('4. Bilan & ratios'!AU8+'4. Bilan & ratios'!AU9)=0),1,0)","v":0},{"$f":"IF(AND('2. P&L'!AV78<0,('4. Bilan & ratios'!AV8+'4. Bilan & ratios'!AV9)=0),1,0)","v":0},{"$f":"IF(AND('2. P&L'!AW78<0,('4. Bilan & ratios'!AW8+'4. Bilan & ratios'!AW9)=0),1,0)","v":0},{"$f":"IF(AND('2. P&L'!AX78<0,('4. Bilan & ratios'!AX8+'4. Bilan & ratios'!AX9)=0),1,0)","v":0},{"$f":"IF(AND('2. P&L'!AY78<0,('4. Bilan & ratios'!AY8+'4. Bilan & ratios'!AY9)=0),1,0)","v":0},{"$f":"IF(AND('2. P&L'!AZ78<0,('4. Bilan & ratios'!AZ8+'4. Bilan & ratios'!AZ9)=0),1,0)","v":0},{"$f":"IF(AND('2. P&L'!BA78<0,('4. Bilan & ratios'!BA8+'4. Bilan & ratios'!BA9)=0),1,0)","v":0},{"$f":"IF(AND('2. P&L'!BB78<0,('4. Bilan & ratios'!BB8+'4. Bilan & ratios'!BB9)=0),1,0)","v":0},{"$f":"IF(AND('2. P&L'!BC78<0,('4. Bilan & ratios'!BC8+'4. Bilan & ratios'!BC9)=0),1,0)","v":0},{"$f":"IF(AND('2. P&L'!BD78<0,('4. Bilan & ratios'!BD8+'4. Bilan & ratios'!BD9)=0),1,0)","v":0},{"$f":"IF(AND('2. P&L'!BE78<0,('4. Bilan & ratios'!BE8+'4. Bilan & ratios'!BE9)=0),1,0)","v":0},{"$f":"IF(AND('2. P&L'!BF78<0,('4. Bilan & ratios'!BF8+'4. Bilan & ratios'!BF9)=0),1,0)","v":0},{"$f":"IF(AND('2. P&L'!BG78<0,('4. Bilan & ratios'!BG8+'4. Bilan & ratios'!BG9)=0),1,0)","v":0},{"$f":"IF(AND('2. P&L'!BH78<0,('4. Bilan & ratios'!BH8+'4. Bilan & ratios'!BH9)=0),1,0)","v":0},{"$f":"IF(AND('2. P&L'!BI78<0,('4. Bilan & ratios'!BI8+'4. Bilan & ratios'!BI9)=0),1,0)","v":0},{"$f":"IF(AND('2. P&L'!BJ78<0,('4. Bilan & ratios'!BJ8+'4. Bilan & ratios'!BJ9)=0),1,0)","v":0},{"$f":"IF(AND('2. P&L'!BK78<0,('4. Bilan & ratios'!BK8+'4. Bilan & ratios'!BK9)=0),1,0)","v":0},{"$f":"IF(AND('2. P&L'!BL78<0,('4. Bilan & ratios'!BL8+'4. Bilan & ratios'!BL9)=0),1,0)","v":0},{"$f":"IF(AND('2. P&L'!BM78<0,('4. Bilan & ratios'!BM8+'4. Bilan & ratios'!BM9)=0),1,0)","v":0},{"$f":"IF(AND('2. P&L'!BN78<0,('4. Bilan & ratios'!BN8+'4. Bilan & ratios'!BN9)=0),1,0)","v":0},{"$f":"IF(AND('2. P&L'!BO78<0,('4. Bilan & ratios'!BO8+'4. Bilan & ratios'!BO9)=0),1,0)","v":0},{"$f":"IF(AND('2. P&L'!BP78<0,('4. Bilan & ratios'!BP8+'4. Bilan & ratios'!BP9)=0),1,0)","v":0},{"$f":"IF(AND('2. P&L'!BQ78<0,('4. Bilan & ratios'!BQ8+'4. Bilan & ratios'!BQ9)=0),1,0)","v":0},{"$f":"IF(AND('2. P&L'!BR78<0,('4. Bilan & ratios'!BR8+'4. Bilan & ratios'!BR9)=0),1,0)","v":0},{"$f":"IF(AND('2. P&L'!BS78<0,('4. Bilan & ratios'!BS8+'4. Bilan & ratios'!BS9)=0),1,0)","v":0},{"$f":"IF(AND('2. P&L'!BT78<0,('4. Bilan & ratios'!BT8+'4. Bilan & ratios'!BT9)=0),1,0)","v":0},{"$f":"IF(AND('2. P&L'!BU78<0,('4. Bilan & ratios'!BU8+'4. Bilan & ratios'!BU9)=0),1,0)","v":0},{"$f":"IF(AND('2. P&L'!BV78<0,('4. Bilan & ratios'!BV8+'4. Bilan & ratios'!BV9)=0),1,0)","v":0},{"$f":"IF(AND('2. P&L'!BW78<0,('4. Bilan & ratios'!BW8+'4. Bilan & ratios'!BW9)=0),1,0)","v":0},{"$f":"IF(AND('2. P&L'!BX78<0,('4. Bilan & ratios'!BX8+'4. Bilan & ratios'!BX9)=0),1,0)","v":0},{"$f":"IF(AND('2. P&L'!BY78<0,('4. Bilan & ratios'!BY8+'4. Bilan & ratios'!BY9)=0),1,0)","v":0},{"$f":"IF(AND('2. P&L'!BZ78<0,('4. Bilan & ratios'!BZ8+'4. Bilan & ratios'!BZ9)=0),1,0)","v":0},{"$f":"IF(AND('2. P&L'!CA78<0,('4. Bilan & ratios'!CA8+'4. Bilan & ratios'!CA9)=0),1,0)","v":0},{"$f":"IF(AND('2. P&L'!CB78<0,('4. Bilan & ratios'!CB8+'4. Bilan & ratios'!CB9)=0),1,0)","v":0}]
[]
["Check immobilisations financières >= 0","Vérifie que le montant des immobilisations financières inscrites à l'actif du bilan est toujours positif ou nul",null,null,{"$f":"IF(MIN('4. Bilan & ratios'!F10:AB10)>=0, \"OK\", \"CHECK\")","v":"OK"}]
[]
["Check subventions = 0","Vérification que les subventions d'investissements sont intégralement amorties en fin de concession",null,null,{"$f":"IF(SUM(F46:AB46)=1, \"OK\", \"CHECK\")","v":"CHECK"},{"$f":"IF(AND('2. P&L'!F86>0,'4. Bilan & ratios'!F32=0),1,0)","v":0},{"$f":"IF(AND('2. P&L'!G86>0,'4. Bilan & ratios'!G32=0),1,0)","v":0},{"$f":"IF(AND('2. P&L'!H86>0,'4. Bilan & ratios'!H32=0),1,0)","v":0},{"$f":"IF(AND('2. P&L'!I86>0,'4. Bilan & ratios'!I32=0),1,0)","v":0},{"$f":"IF(AND('2. P&L'!J86>0,'4. Bilan & ratios'!J32=0),1,0)","v":0},{"$f":"IF(AND('2. P&L'!K86>0,'4. Bilan & ratios'!K32=0),1,0)","v":0},{"$f":"IF(AND('2. P&L'!L86>0,'4. Bilan & ratios'!L32=0),1,0)","v":0},{"$f":"IF(AND('2. P&L'!M86>0,'4. Bilan & ratios'!M32=0),1,0)","v":0},{"$f":"IF(AND('2. P&L'!N86>0,'4. Bilan & ratios'!N32=0),1,0)","v":0},{"$f":"IF(AND('2. P&L'!O86>0,'4. Bilan & ratios'!O32=0),1,0)","v":0},{"$f":"IF(AND('2. P&L'!P86>0,'4. Bilan & ratios'!P32=0),1,0)","v":0},{"$f":"IF(AND('2. P&L'!Q86>0,'4. Bilan & ratios'!Q32=0),1,0)","v":0},{"$f":"IF(AND('2. P&L'!R86>0,'4. Bilan & ratios'!R32=0),1,0)","v":0},{"$f":"IF(AND('2. P&L'!S86>0,'4. Bilan & ratios'!S32=0),1,0)","v":0},{"$f":"IF(AND('2. P&L'!T86>0,'4. Bilan & ratios'!T32=0),1,0)","v":0},{"$f":"IF(AND('2. P&L'!U86>0,'4. Bilan & ratios'!U32=0),1,0)","v":0},{"$f":"IF(AND('2. P&L'!V86>0,'4. Bilan & ratios'!V32=0),1,0)","v":0},{"$f":"IF(AND('2. P&L'!W86>0,'4. Bilan & ratios'!W32=0),1,0)","v":0},{"$f":"IF(AND('2. P&L'!X86>0,'4. Bilan & ratios'!X32=0),1,0)","v":0},{"$f":"IF(AND('2. P&L'!Y86>0,'4. Bilan & ratios'!Y32=0),1,0)","v":0},{"$f":"IF(AND('2. P&L'!Z86>0,'4. Bilan & ratios'!Z32=0),1,0)","v":0},{"$f":"IF(AND('2. P&L'!AA86>0,'4. Bilan & ratios'!AA32=0),1,0)","v":0},{"$f":"IF(AND('2. P&L'!AB86>0,'4. Bilan & ratios'!AB32=0),1,0)","v":0},{"$f":"IF(AND('2. P&L'!AC86>0,'4. Bilan & ratios'!AC32=0),1,0)","v":0},{"$f":"IF(AND('2. P&L'!AD86>0,'4. Bilan & ratios'!AD32=0),1,0)","v":0},{"$f":"IF(AND('2. P&L'!AE86>0,'4. Bilan & ratios'!AE32=0),1,0)","v":0},{"$f":"IF(AND('2. P&L'!AF86>0,'4. Bilan & ratios'!AF32=0),1,0)","v":0},{"$f":"IF(AND('2. P&L'!AG86>0,'4. Bilan & ratios'!AG32=0),1,0)","v":0},{"$f":"IF(AND('2. P&L'!AH86>0,'4. Bilan & ratios'!AH32=0),1,0)","v":0},{"$f":"IF(AND('2. P&L'!AI86>0,'4. Bilan & ratios'!AI32=0),1,0)","v":0},{"$f":"IF(AND('2. P&L'!AJ86>0,'4. Bilan & ratios'!AJ32=0),1,0)","v":0},{"$f":"IF(AND('2. P&L'!AK86>0,'4. Bilan & ratios'!AK32=0),1,0)","v":0},{"$f":"IF(AND('2. P&L'!AL86>0,'4. Bilan & ratios'!AL32=0),1,0)","v":0},{"$f":"IF(AND('2. P&L'!AM86>0,'4. Bilan & ratios'!AM32=0),1,0)","v":0},{"$f":"IF(AND('2. P&L'!AN86>0,'4. Bilan & ratios'!AN32=0),1,0)","v":0},{"$f":"IF(AND('2. P&L'!AO86>0,'4. Bilan & ratios'!AO32=0),1,0)","v":0},{"$f":"IF(AND('2. P&L'!AP86>0,'4. Bilan & ratios'!AP32=0),1,0)","v":0},{"$f":"IF(AND('2. P&L'!AQ86>0,'4. Bilan & ratios'!AQ32=0),1,0)","v":0},{"$f":"IF(AND('2. P&L'!AR86>0,'4. Bilan & ratios'!AR32=0),1,0)","v":0},{"$f":"IF(AND('2. P&L'!AS86>0,'4. Bilan & ratios'!AS32=0),1,0)","v":0},{"$f":"IF(AND('2. P&L'!AT86>0,'4. Bilan & ratios'!AT32=0),1,0)","v":0},{"$f":"IF(AND('2. P&L'!AU86>0,'4. Bilan & ratios'!AU32=0),1,0)","v":0},{"$f":"IF(AND('2. P&L'!AV86>0,'4. Bilan & ratios'!AV32=0),1,0)","v":0},{"$f":"IF(AND('2. P&L'!AW86>0,'4. Bilan & ratios'!AW32=0),1,0)","v":0},{"$f":"IF(AND('2. P&L'!AX86>0,'4. Bilan & ratios'!AX32=0),1,0)","v":0},{"$f":"IF(AND('2. P&L'!AY86>0,'4. Bilan & ratios'!AY32=0),1,0)","v":0},{"$f":"IF(AND('2. P&L'!AZ86>0,'4. Bilan & ratios'!AZ32=0),1,0)","v":0},{"$f":"IF(AND('2. P&L'!BA86>0,'4. Bilan & ratios'!BA32=0),1,0)","v":0},{"$f":"IF(AND('2. P&L'!BB86>0,'4. Bilan & ratios'!BB32=0),1,0)","v":0},{"$f":"IF(AND('2. P&L'!BC86>0,'4. Bilan & ratios'!BC32=0),1,0)","v":0},{"$f":"IF(AND('2. P&L'!BD86>0,'4. Bilan & ratios'!BD32=0),1,0)","v":0},{"$f":"IF(AND('2. P&L'!BE86>0,'4. Bilan & ratios'!BE32=0),1,0)","v":0},{"$f":"IF(AND('2. P&L'!BF86>0,'4. Bilan & ratios'!BF32=0),1,0)","v":0},{"$f":"IF(AND('2. P&L'!BG86>0,'4. Bilan & ratios'!BG32=0),1,0)","v":0},{"$f":"IF(AND('2. P&L'!BH86>0,'4. Bilan & ratios'!BH32=0),1,0)","v":0},{"$f":"IF(AND('2. P&L'!BI86>0,'4. Bilan & ratios'!BI32=0),1,0)","v":0},{"$f":"IF(AND('2. P&L'!BJ86>0,'4. Bilan & ratios'!BJ32=0),1,0)","v":0},{"$f":"IF(AND('2. P&L'!BK86>0,'4. Bilan & ratios'!BK32=0),1,0)","v":0},{"$f":"IF(AND('2. P&L'!BL86>0,'4. Bilan & ratios'!BL32=0),1,0)","v":0},{"$f":"IF(AND('2. P&L'!BM86>0,'4. Bilan & ratios'!BM32=0),1,0)","v":0},{"$f":"IF(AND('2. P&L'!BN86>0,'4. Bilan & ratios'!BN32=0),1,0)","v":0},{"$f":"IF(AND('2. P&L'!BO86>0,'4. Bilan & ratios'!BO32=0),1,0)","v":0},{"$f":"IF(AND('2. P&L'!BP86>0,'4. Bilan & ratios'!BP32=0),1,0)","v":0},{"$f":"IF(AND('2. P&L'!BQ86>0,'4. Bilan & ratios'!BQ32=0),1,0)","v":0},{"$f":"IF(AND('2. P&L'!BR86>0,'4. Bilan & ratios'!BR32=0),1,0)","v":0},{"$f":"IF(AND('2. P&L'!BS86>0,'4. Bilan & ratios'!BS32=0),1,0)","v":0},{"$f":"IF(AND('2. P&L'!BT86>0,'4. Bilan & ratios'!BT32=0),1,0)","v":0},{"$f":"IF(AND('2. P&L'!BU86>0,'4. Bilan & ratios'!BU32=0),1,0)","v":0},{"$f":"IF(AND('2. P&L'!BV86>0,'4. Bilan & ratios'!BV32=0),1,0)","v":0},{"$f":"IF(AND('2. P&L'!BW86>0,'4. Bilan & ratios'!BW32=0),1,0)","v":0},{"$f":"IF(AND('2. P&L'!BX86>0,'4. Bilan & ratios'!BX32=0),1,0)","v":0},{"$f":"IF(AND('2. P&L'!BY86>0,'4. Bilan & ratios'!BY32=0),1,0)","v":0},{"$f":"IF(AND('2. P&L'!BZ86>0,'4. Bilan & ratios'!BZ32=0),1,0)","v":0},{"$f":"IF(AND('2. P&L'!CA86>0,'4. Bilan & ratios'!CA32=0),1,0)","v":0},{"$f":"IF(AND('2. P&L'!CB86>0,'4. Bilan & ratios'!CB32=0),1,0)","v":0}]
[]
["Check emprunts et dettes financières >= 0","Vérifier que le montant du poste Emprunts et dettes financières au passif du bilan est toujours positif ou nul",null,null,{"$f":"IF(MIN('4. Bilan & ratios'!F40:AB40)>=0, \"OK\", \"CHECK\")","v":"OK"}]
[]
[]
["Checks P&L et CF"]
[]
["Check Ebit","Cohérence entre Ebit du P&L et celui du tableau de Cash Flow",null,null,{"$f":"IF(SUM(F53:AB53)<10^-2, \"OK\", \"CHECK\")","v":"OK"},{"$f":"'3. CF'!F5-'2. P&L'!F87","v":0},{"$f":"'3. CF'!G5-'2. P&L'!G87","v":0},{"$f":"'3. CF'!H5-'2. P&L'!H87","v":0},{"$f":"'3. CF'!I5-'2. P&L'!I87","v":0},{"$f":"'3. CF'!J5-'2. P&L'!J87","v":0},{"$f":"'3. CF'!K5-'2. P&L'!K87","v":0},{"$f":"'3. CF'!L5-'2. P&L'!L87","v":0},{"$f":"'3. CF'!M5-'2. P&L'!M87","v":0},{"$f":"'3. CF'!N5-'2. P&L'!N87","v":0},{"$f":"'3. CF'!O5-'2. P&L'!O87","v":0},{"$f":"'3. CF'!P5-'2. P&L'!P87","v":0},{"$f":"'3. CF'!Q5-'2. P&L'!Q87","v":0},{"$f":"'3. CF'!R5-'2. P&L'!R87","v":0},{"$f":"'3. CF'!S5-'2. P&L'!S87","v":0},{"$f":"'3. CF'!T5-'2. P&L'!T87","v":0},{"$f":"'3. CF'!U5-'2. P&L'!U87","v":0},{"$f":"'3. CF'!V5-'2. P&L'!V87","v":0},{"$f":"'3. CF'!W5-'2. P&L'!W87","v":0},{"$f":"'3. CF'!X5-'2. P&L'!X87","v":0},{"$f":"'3. CF'!Y5-'2. P&L'!Y87","v":0},{"$f":"'3. CF'!Z5-'2. P&L'!Z87","v":0},{"$f":"'3. CF'!AA5-'2. P&L'!AA87","v":0},{"$f":"'3. CF'!AB5-'2. P&L'!AB87","v":0},{"$f":"'3. CF'!AC5-'2. P&L'!AC87","v":0},{"$f":"'3. CF'!AD5-'2. P&L'!AD87","v":0},{"$f":"'3. CF'!AE5-'2. P&L'!AE87","v":0},{"$f":"'3. CF'!AF5-'2. P&L'!AF87","v":0},{"$f":"'3. CF'!AG5-'2. P&L'!AG87","v":0},{"$f":"'3. CF'!AH5-'2. P&L'!AH87","v":0},{"$f":"'3. CF'!AI5-'2. P&L'!AI87","v":0},{"$f":"'3. CF'!AJ5-'2. P&L'!AJ87","v":0},{"$f":"'3. CF'!AK5-'2. P&L'!AK87","v":0},{"$f":"'3. CF'!AL5-'2. P&L'!AL87","v":0},{"$f":"'3. CF'!AM5-'2. P&L'!AM87","v":0},{"$f":"'3. CF'!AN5-'2. P&L'!AN87","v":0},{"$f":"'3. CF'!AO5-'2. P&L'!AO87","v":0},{"$f":"'3. CF'!AP5-'2. P&L'!AP87","v":0},{"$f":"'3. CF'!AQ5-'2. P&L'!AQ87","v":0},{"$f":"'3. CF'!AR5-'2. P&L'!AR87","v":0},{"$f":"'3. CF'!AS5-'2. P&L'!AS87","v":0},{"$f":"'3. CF'!AT5-'2. P&L'!AT87","v":0},{"$f":"'3. CF'!AU5-'2. P&L'!AU87","v":0},{"$f":"'3. CF'!AV5-'2. P&L'!AV87","v":0},{"$f":"'3. CF'!AW5-'2. P&L'!AW87","v":0},{"$f":"'3. CF'!AX5-'2. P&L'!AX87","v":0},{"$f":"'3. CF'!AY5-'2. P&L'!AY87","v":0},{"$f":"'3. CF'!AZ5-'2. P&L'!AZ87","v":0},{"$f":"'3. CF'!BA5-'2. P&L'!BA87","v":0},{"$f":"'3. CF'!BB5-'2. P&L'!BB87","v":0},{"$f":"'3. CF'!BC5-'2. P&L'!BC87","v":0},{"$f":"'3. CF'!BD5-'2. P&L'!BD87","v":0},{"$f":"'3. CF'!BE5-'2. P&L'!BE87","v":0},{"$f":"'3. CF'!BF5-'2. P&L'!BF87","v":0},{"$f":"'3. CF'!BG5-'2. P&L'!BG87","v":0},{"$f":"'3. CF'!BH5-'2. P&L'!BH87","v":0},{"$f":"'3. CF'!BI5-'2. P&L'!BI87","v":0},{"$f":"'3. CF'!BJ5-'2. P&L'!BJ87","v":0},{"$f":"'3. CF'!BK5-'2. P&L'!BK87","v":0},{"$f":"'3. CF'!BL5-'2. P&L'!BL87","v":0},{"$f":"'3. CF'!BM5-'2. P&L'!BM87","v":0},{"$f":"'3. CF'!BN5-'2. P&L'!BN87","v":0},{"$f":"'3. CF'!BO5-'2. P&L'!BO87","v":0},{"$f":"'3. CF'!BP5-'2. P&L'!BP87","v":0},{"$f":"'3. CF'!BQ5-'2. P&L'!BQ87","v":0},{"$f":"'3. CF'!BR5-'2. P&L'!BR87","v":0},{"$f":"'3. CF'!BS5-'2. P&L'!BS87","v":0},{"$f":"'3. CF'!BT5-'2. P&L'!BT87","v":0},{"$f":"'3. CF'!BU5-'2. P&L'!BU87","v":0},{"$f":"'3. CF'!BV5-'2. P&L'!BV87","v":0},{"$f":"'3. CF'!BW5-'2. P&L'!BW87","v":0},{"$f":"'3. CF'!BX5-'2. P&L'!BX87","v":0},{"$f":"'3. CF'!BY5-'2. P&L'!BY87","v":0},{"$f":"'3. CF'!BZ5-'2. P&L'!BZ87","v":0},{"$f":"'3. CF'!CA5-'2. P&L'!CA87","v":0},{"$f":"'3. CF'!CB5-'2. P&L'!CB87","v":0}]
[]
["Check amortissements et provisions","Vérification que le montant des amortissements et provisions du P&L est identique à celui du tableau de Cash Flow",null,null,{"$f":"IF(SUM(F55:AB55)<10^-2, \"OK\", \"CHECK\")","v":"OK"},{"$f":"'3. CF'!F6+'2. P&L'!F78+'2. P&L'!F81+'2. P&L'!F86","v":0},{"$f":"'3. CF'!G6+'2. P&L'!G78+'2. P&L'!G81+'2. P&L'!G86","v":0},{"$f":"'3. CF'!H6+'2. P&L'!H78+'2. P&L'!H81+'2. P&L'!H86","v":0},{"$f":"'3. CF'!I6+'2. P&L'!I78+'2. P&L'!I81+'2. P&L'!I86","v":0},{"$f":"'3. CF'!J6+'2. P&L'!J78+'2. P&L'!J81+'2. P&L'!J86","v":0},{"$f":"'3. CF'!K6+'2. P&L'!K78+'2. P&L'!K81+'2. P&L'!K86","v":0},{"$f":"'3. CF'!L6+'2. P&L'!L78+'2. P&L'!L81+'2. P&L'!L86","v":0},{"$f":"'3. CF'!M6+'2. P&L'!M78+'2. P&L'!M81+'2. P&L'!M86","v":0},{"$f":"'3. CF'!N6+'2. P&L'!N78+'2. P&L'!N81+'2. P&L'!N86","v":0},{"$f":"'3. CF'!O6+'2. P&L'!O78+'2. P&L'!O81+'2. P&L'!O86","v":0},{"$f":"'3. CF'!P6+'2. P&L'!P78+'2. P&L'!P81+'2. P&L'!P86","v":0},{"$f":"'3. CF'!Q6+'2. P&L'!Q78+'2. P&L'!Q81+'2. P&L'!Q86","v":0},{"$f":"'3. CF'!R6+'2. P&L'!R78+'2. P&L'!R81+'2. P&L'!R86","v":0},{"$f":"'3. CF'!S6+'2. P&L'!S78+'2. P&L'!S81+'2. P&L'!S86","v":0},{"$f":"'3. CF'!T6+'2. P&L'!T78+'2. P&L'!T81+'2. P&L'!T86","v":0},{"$f":"'3. CF'!U6+'2. P&L'!U78+'2. P&L'!U81+'2. P&L'!U86","v":0},{"$f":"'3. CF'!V6+'2. P&L'!V78+'2. P&L'!V81+'2. P&L'!V86","v":0},{"$f":"'3. CF'!W6+'2. P&L'!W78+'2. P&L'!W81+'2. P&L'!W86","v":0},{"$f":"'3. CF'!X6+'2. P&L'!X78+'2. P&L'!X81+'2. P&L'!X86","v":0},{"$f":"'3. CF'!Y6+'2. P&L'!Y78+'2. P&L'!Y81+'2. P&L'!Y86","v":0},{"$f":"'3. CF'!Z6+'2. P&L'!Z78+'2. P&L'!Z81+'2. P&L'!Z86","v":0},{"$f":"'3. CF'!AA6+'2. P&L'!AA78+'2. P&L'!AA81+'2. P&L'!AA86","v":0},{"$f":"'3. CF'!AB6+'2. P&L'!AB78+'2. P&L'!AB81+'2. P&L'!AB86","v":0},{"$f":"'3. CF'!AC6+'2. P&L'!AC78+'2. P&L'!AC81+'2. P&L'!AC86","v":0},{"$f":"'3. CF'!AD6+'2. P&L'!AD78+'2. P&L'!AD81+'2. P&L'!AD86","v":0},{"$f":"'3. CF'!AE6+'2. P&L'!AE78+'2. P&L'!AE81+'2. P&L'!AE86","v":0},{"$f":"'3. CF'!AF6+'2. P&L'!AF78+'2. P&L'!AF81+'2. P&L'!AF86","v":0},{"$f":"'3. CF'!AG6+'2. P&L'!AG78+'2. P&L'!AG81+'2. P&L'!AG86","v":0},{"$f":"'3. CF'!AH6+'2. P&L'!AH78+'2. P&L'!AH81+'2. P&L'!AH86","v":0},{"$f":"'3. CF'!AI6+'2. P&L'!AI78+'2. P&L'!AI81+'2. P&L'!AI86","v":0},{"$f":"'3. CF'!AJ6+'2. P&L'!AJ78+'2. P&L'!AJ81+'2. P&L'!AJ86","v":0},{"$f":"'3. CF'!AK6+'2. P&L'!AK78+'2. P&L'!AK81+'2. P&L'!AK86","v":0},{"$f":"'3. CF'!AL6+'2. P&L'!AL78+'2. P&L'!AL81+'2. P&L'!AL86","v":0},{"$f":"'3. CF'!AM6+'2. P&L'!AM78+'2. P&L'!AM81+'2. P&L'!AM86","v":0},{"$f":"'3. CF'!AN6+'2. P&L'!AN78+'2. P&L'!AN81+'2. P&L'!AN86","v":0},{"$f":"'3. CF'!AO6+'2. P&L'!AO78+'2. P&L'!AO81+'2. P&L'!AO86","v":0},{"$f":"'3. CF'!AP6+'2. P&L'!AP78+'2. P&L'!AP81+'2. P&L'!AP86","v":0},{"$f":"'3. CF'!AQ6+'2. P&L'!AQ78+'2. P&L'!AQ81+'2. P&L'!AQ86","v":0},{"$f":"'3. CF'!AR6+'2. P&L'!AR78+'2. P&L'!AR81+'2. P&L'!AR86","v":0},{"$f":"'3. CF'!AS6+'2. P&L'!AS78+'2. P&L'!AS81+'2. P&L'!AS86","v":0},{"$f":"'3. CF'!AT6+'2. P&L'!AT78+'2. P&L'!AT81+'2. P&L'!AT86","v":0},{"$f":"'3. CF'!AU6+'2. P&L'!AU78+'2. P&L'!AU81+'2. P&L'!AU86","v":0},{"$f":"'3. CF'!AV6+'2. P&L'!AV78+'2. P&L'!AV81+'2. P&L'!AV86","v":0},{"$f":"'3. CF'!AW6+'2. P&L'!AW78+'2. P&L'!AW81+'2. P&L'!AW86","v":0},{"$f":"'3. CF'!AX6+'2. P&L'!AX78+'2. P&L'!AX81+'2. P&L'!AX86","v":0},{"$f":"'3. CF'!AY6+'2. P&L'!AY78+'2. P&L'!AY81+'2. P&L'!AY86","v":0},{"$f":"'3. CF'!AZ6+'2. P&L'!AZ78+'2. P&L'!AZ81+'2. P&L'!AZ86","v":0},{"$f":"'3. CF'!BA6+'2. P&L'!BA78+'2. P&L'!BA81+'2. P&L'!BA86","v":0},{"$f":"'3. CF'!BB6+'2. P&L'!BB78+'2. P&L'!BB81+'2. P&L'!BB86","v":0},{"$f":"'3. CF'!BC6+'2. P&L'!BC78+'2. P&L'!BC81+'2. P&L'!BC86","v":0},{"$f":"'3. CF'!BD6+'2. P&L'!BD78+'2. P&L'!BD81+'2. P&L'!BD86","v":0},{"$f":"'3. CF'!BE6+'2. P&L'!BE78+'2. P&L'!BE81+'2. P&L'!BE86","v":0},{"$f":"'3. CF'!BF6+'2. P&L'!BF78+'2. P&L'!BF81+'2. P&L'!BF86","v":0},{"$f":"'3. CF'!BG6+'2. P&L'!BG78+'2. P&L'!BG81+'2. P&L'!BG86","v":0},{"$f":"'3. CF'!BH6+'2. P&L'!BH78+'2. P&L'!BH81+'2. P&L'!BH86","v":0},{"$f":"'3. CF'!BI6+'2. P&L'!BI78+'2. P&L'!BI81+'2. P&L'!BI86","v":0},{"$f":"'3. CF'!BJ6+'2. P&L'!BJ78+'2. P&L'!BJ81+'2. P&L'!BJ86","v":0},{"$f":"'3. CF'!BK6+'2. P&L'!BK78+'2. P&L'!BK81+'2. P&L'!BK86","v":0},{"$f":"'3. CF'!BL6+'2. P&L'!BL78+'2. P&L'!BL81+'2. P&L'!BL86","v":0},{"$f":"'3. CF'!BM6+'2. P&L'!BM78+'2. P&L'!BM81+'2. P&L'!BM86","v":0},{"$f":"'3. CF'!BN6+'2. P&L'!BN78+'2. P&L'!BN81+'2. P&L'!BN86","v":0},{"$f":"'3. CF'!BO6+'2. P&L'!BO78+'2. P&L'!BO81+'2. P&L'!BO86","v":0},{"$f":"'3. CF'!BP6+'2. P&L'!BP78+'2. P&L'!BP81+'2. P&L'!BP86","v":0},{"$f":"'3. CF'!BQ6+'2. P&L'!BQ78+'2. P&L'!BQ81+'2. P&L'!BQ86","v":0},{"$f":"'3. CF'!BR6+'2. P&L'!BR78+'2. P&L'!BR81+'2. P&L'!BR86","v":0},{"$f":"'3. CF'!BS6+'2. P&L'!BS78+'2. P&L'!BS81+'2. P&L'!BS86","v":0},{"$f":"'3. CF'!BT6+'2. P&L'!BT78+'2. P&L'!BT81+'2. P&L'!BT86","v":0},{"$f":"'3. CF'!BU6+'2. P&L'!BU78+'2. P&L'!BU81+'2. P&L'!BU86","v":0},{"$f":"'3. CF'!BV6+'2. P&L'!BV78+'2. P&L'!BV81+'2. P&L'!BV86","v":0},{"$f":"'3. CF'!BW6+'2. P&L'!BW78+'2. P&L'!BW81+'2. P&L'!BW86","v":0},{"$f":"'3. CF'!BX6+'2. P&L'!BX78+'2. P&L'!BX81+'2. P&L'!BX86","v":0},{"$f":"'3. CF'!BY6+'2. P&L'!BY78+'2. P&L'!BY81+'2. P&L'!BY86","v":0},{"$f":"'3. CF'!BZ6+'2. P&L'!BZ78+'2. P&L'!BZ81+'2. P&L'!BZ86","v":0},{"$f":"'3. CF'!CA6+'2. P&L'!CA78+'2. P&L'!CA81+'2. P&L'!CA86","v":0},{"$f":"'3. CF'!CB6+'2. P&L'!CB78+'2. P&L'!CB81+'2. P&L'!CB86","v":0}]
[]
[]
["Check Bilan et Dette"]
[]
["Check dette 31/12/2016","Vérifie que le montant du poste Emprunts et dettes financières au passif du bilan est toujours positif ou nul",null,null,{"$f":"IF(ABS('4. Bilan & ratios'!I40-SUM('6. Dette'!J5:J18)-SUM('6. Dette'!J38:J50)+SUM('6. Dette'!J55:J58))<10^-1,\"OK\",\"CHECK\")","v":"OK"}]
[]
[]
["Checks Bilan et CF"]
[]
["Check trésorerie","Cohérence entre le montant de trésorerie de clôture  du tableau de Cash Flow et la trésorerie à l'actif du bilan",null,null,{"$f":"IF(ABS(SUM(F65:AB65))<10^-2, \"OK\", \"CHECK\")","v":"OK"},{"$f":"'3. CF'!F33-'4. Bilan & ratios'!F21","v":0},{"$f":"'3. CF'!G33-'4. Bilan & ratios'!G21","v":0},{"$f":"'3. CF'!H33-'4. Bilan & ratios'!H21","v":0},{"$f":"'3. CF'!I33-'4. Bilan & ratios'!I21","v":0},{"$f":"'3. CF'!J33-'4. Bilan & ratios'!J21","v":0},{"$f":"'3. CF'!K33-'4. Bilan & ratios'!K21","v":0},{"$f":"'3. CF'!L33-'4. Bilan & ratios'!L21","v":0},{"$f":"'3. CF'!M33-'4. Bilan & ratios'!M21","v":0},{"$f":"'3. CF'!N33-'4. Bilan & ratios'!N21","v":0},{"$f":"'3. CF'!O33-'4. Bilan & ratios'!O21","v":0},{"$f":"'3. CF'!P33-'4. Bilan & ratios'!P21","v":0},{"$f":"'3. CF'!Q33-'4. Bilan & ratios'!Q21","v":0},{"$f":"'3. CF'!R33-'4. Bilan & ratios'!R21","v":0},{"$f":"'3. CF'!S33-'4. Bilan & ratios'!S21","v":0},{"$f":"'3. CF'!T33-'4. Bilan & ratios'!T21","v":0},{"$f":"'3. CF'!U33-'4. Bilan & ratios'!U21","v":0},{"$f":"'3. CF'!V33-'4. Bilan & ratios'!V21","v":0},{"$f":"'3. CF'!W33-'4. Bilan & ratios'!W21","v":0},{"$f":"'3. CF'!X33-'4. Bilan & ratios'!X21","v":0},{"$f":"'3. CF'!Y33-'4. Bilan & ratios'!Y21","v":0},{"$f":"'3. CF'!Z33-'4. Bilan & ratios'!Z21","v":0},{"$f":"'3. CF'!AA33-'4. Bilan & ratios'!AA21","v":0},{"$f":"'3. CF'!AB33-'4. Bilan & ratios'!AB21","v":0},{"$f":"'3. CF'!AC33-'4. Bilan & ratios'!AC21","v":0},{"$f":"'3. CF'!AD33-'4. Bilan & ratios'!AD21","v":0},{"$f":"'3. CF'!AE33-'4. Bilan & ratios'!AE21","v":0},{"$f":"'3. CF'!AF33-'4. Bilan & ratios'!AF21","v":0},{"$f":"'3. CF'!AG33-'4. Bilan & ratios'!AG21","v":0},{"$f":"'3. CF'!AH33-'4. Bilan & ratios'!AH21","v":0},{"$f":"'3. CF'!AI33-'4. Bilan & ratios'!AI21","v":0},{"$f":"'3. CF'!AJ33-'4. Bilan & ratios'!AJ21","v":0},{"$f":"'3. CF'!AK33-'4. Bilan & ratios'!AK21","v":0},{"$f":"'3. CF'!AL33-'4. Bilan & ratios'!AL21","v":0},{"$f":"'3. CF'!AM33-'4. Bilan & ratios'!AM21","v":0},{"$f":"'3. CF'!AN33-'4. Bilan & ratios'!AN21","v":0},{"$f":"'3. CF'!AO33-'4. Bilan & ratios'!AO21","v":0},{"$f":"'3. CF'!AP33-'4. Bilan & ratios'!AP21","v":0},{"$f":"'3. CF'!AQ33-'4. Bilan & ratios'!AQ21","v":0},{"$f":"'3. CF'!AR33-'4. Bilan & ratios'!AR21","v":0},{"$f":"'3. CF'!AS33-'4. Bilan & ratios'!AS21","v":0},{"$f":"'3. CF'!AT33-'4. Bilan & ratios'!AT21","v":0},{"$f":"'3. CF'!AU33-'4. Bilan & ratios'!AU21","v":0},{"$f":"'3. CF'!AV33-'4. Bilan & ratios'!AV21","v":0},{"$f":"'3. CF'!AW33-'4. Bilan & ratios'!AW21","v":0},{"$f":"'3. CF'!AX33-'4. Bilan & ratios'!AX21","v":0},{"$f":"'3. CF'!AY33-'4. Bilan & ratios'!AY21","v":0},{"$f":"'3. CF'!AZ33-'4. Bilan & ratios'!AZ21","v":0},{"$f":"'3. CF'!BA33-'4. Bilan & ratios'!BA21","v":0},{"$f":"'3. CF'!BB33-'4. Bilan & ratios'!BB21","v":0},{"$f":"'3. CF'!BC33-'4. Bilan & ratios'!BC21","v":0},{"$f":"'3. CF'!BD33-'4. Bilan & ratios'!BD21","v":0},{"$f":"'3. CF'!BE33-'4. Bilan & ratios'!BE21","v":0},{"$f":"'3. CF'!BF33-'4. Bilan & ratios'!BF21","v":0},{"$f":"'3. CF'!BG33-'4. Bilan & ratios'!BG21","v":0},{"$f":"'3. CF'!BH33-'4. Bilan & ratios'!BH21","v":0},{"$f":"'3. CF'!BI33-'4. Bilan & ratios'!BI21","v":0},{"$f":"'3. CF'!BJ33-'4. Bilan & ratios'!BJ21","v":0},{"$f":"'3. CF'!BK33-'4. Bilan & ratios'!BK21","v":0},{"$f":"'3. CF'!BL33-'4. Bilan & ratios'!BL21","v":0},{"$f":"'3. CF'!BM33-'4. Bilan & ratios'!BM21","v":0},{"$f":"'3. CF'!BN33-'4. Bilan & ratios'!BN21","v":0},{"$f":"'3. CF'!BO33-'4. Bilan & ratios'!BO21","v":0},{"$f":"'3. CF'!BP33-'4. Bilan & ratios'!BP21","v":0},{"$f":"'3. CF'!BQ33-'4. Bilan & ratios'!BQ21","v":0},{"$f":"'3. CF'!BR33-'4. Bilan & ratios'!BR21","v":0},{"$f":"'3. CF'!BS33-'4. Bilan & ratios'!BS21","v":0},{"$f":"'3. CF'!BT33-'4. Bilan & ratios'!BT21","v":0},{"$f":"'3. CF'!BU33-'4. Bilan & ratios'!BU21","v":0},{"$f":"'3. CF'!BV33-'4. Bilan & ratios'!BV21","v":0},{"$f":"'3. CF'!BW33-'4. Bilan & ratios'!BW21","v":0},{"$f":"'3. CF'!BX33-'4. Bilan & ratios'!BX21","v":0},{"$f":"'3. CF'!BY33-'4. Bilan & ratios'!BY21","v":0},{"$f":"'3. CF'!BZ33-'4. Bilan & ratios'!BZ21","v":0},{"$f":"'3. CF'!CA33-'4. Bilan & ratios'!CA21","v":0},{"$f":"'3. CF'!CB33-'4. Bilan & ratios'!CB21","v":0}]
[]
["Check BFR","Cohérence entre la variation de BFR inscrite dans le tableau de Cafh Flow et les montants de BFR du bilan",null,null,{"$f":"IF(ABS(SUM(F67:AB67))<10^-2, \"OK\", \"CHECK\")","v":"OK"},null,null,{"$f":"'3. CF'!H11+('4. Bilan & ratios'!H59-'4. Bilan & ratios'!F59)","v":0},{"$f":"'3. CF'!I11+('4. Bilan & ratios'!I59-'4. Bilan & ratios'!G59)","v":0},{"$f":"'3. CF'!J11+('4. Bilan & ratios'!J59-'4. Bilan & ratios'!I59)","v":0},{"$f":"'3. CF'!K11+('4. Bilan & ratios'!K59-'4. Bilan & ratios'!J59)","v":0},{"$f":"'3. CF'!L11+('4. Bilan & ratios'!L59-'4. Bilan & ratios'!K59)","v":0},{"$f":"'3. CF'!M11+('4. Bilan & ratios'!M59-'4. Bilan & ratios'!L59)","v":0},{"$f":"'3. CF'!N11+('4. Bilan & ratios'!N59-'4. Bilan & ratios'!M59)","v":0},{"$f":"'3. CF'!O11+('4. Bilan & ratios'!O59-'4. Bilan & ratios'!N59)","v":0},{"$f":"'3. CF'!P11+('4. Bilan & ratios'!P59-'4. Bilan & ratios'!O59)","v":0},{"$f":"'3. CF'!Q11+('4. Bilan & ratios'!Q59-'4. Bilan & ratios'!P59)","v":0},{"$f":"'3. CF'!R11+('4. Bilan & ratios'!R59-'4. Bilan & ratios'!Q59)","v":0},{"$f":"'3. CF'!S11+('4. Bilan & ratios'!S59-'4. Bilan & ratios'!R59)","v":0},{"$f":"'3. CF'!T11+('4. Bilan & ratios'!T59-'4. Bilan & ratios'!S59)","v":0},{"$f":"'3. CF'!U11+('4. Bilan & ratios'!U59-'4. Bilan & ratios'!T59)","v":0},{"$f":"'3. CF'!V11+('4. Bilan & ratios'!V59-'4. Bilan & ratios'!U59)","v":0},{"$f":"'3. CF'!W11+('4. Bilan & ratios'!W59-'4. Bilan & ratios'!V59)","v":0},{"$f":"'3. CF'!X11+('4. Bilan & ratios'!X59-'4. Bilan & ratios'!W59)","v":0},{"$f":"'3. CF'!Y11+('4. Bilan & ratios'!Y59-'4. Bilan & ratios'!X59)","v":0},{"$f":"'3. CF'!Z11+('4. Bilan & ratios'!Z59-'4. Bilan & ratios'!Y59)","v":0},{"$f":"'3. CF'!AA11+('4. Bilan & ratios'!AA59-'4. Bilan & ratios'!Z59)","v":0},{"$f":"'3. CF'!AB11+('4. Bilan & ratios'!AB59-'4. Bilan & ratios'!AA59)","v":0},{"$f":"'3. CF'!AC11+('4. Bilan & ratios'!AC59-'4. Bilan & ratios'!AB59)","v":0},{"$f":"'3. CF'!AD11+('4. Bilan & ratios'!AD59-'4. Bilan & ratios'!AC59)","v":0},{"$f":"'3. CF'!AE11+('4. Bilan & ratios'!AE59-'4. Bilan & ratios'!AD59)","v":0},{"$f":"'3. CF'!AF11+('4. Bilan & ratios'!AF59-'4. Bilan & ratios'!AE59)","v":0},{"$f":"'3. CF'!AG11+('4. Bilan & ratios'!AG59-'4. Bilan & ratios'!AF59)","v":0},{"$f":"'3. CF'!AH11+('4. Bilan & ratios'!AH59-'4. Bilan & ratios'!AG59)","v":0},{"$f":"'3. CF'!AI11+('4. Bilan & ratios'!AI59-'4. Bilan & ratios'!AH59)","v":0},{"$f":"'3. CF'!AJ11+('4. Bilan & ratios'!AJ59-'4. Bilan & ratios'!AI59)","v":0},{"$f":"'3. CF'!AK11+('4. Bilan & ratios'!AK59-'4. Bilan & ratios'!AJ59)","v":0},{"$f":"'3. CF'!AL11+('4. Bilan & ratios'!AL59-'4. Bilan & ratios'!AK59)","v":0},{"$f":"'3. CF'!AM11+('4. Bilan & ratios'!AM59-'4. Bilan & ratios'!AL59)","v":0},{"$f":"'3. CF'!AN11+('4. Bilan & ratios'!AN59-'4. Bilan & ratios'!AM59)","v":0},{"$f":"'3. CF'!AO11+('4. Bilan & ratios'!AO59-'4. Bilan & ratios'!AN59)","v":0},{"$f":"'3. CF'!AP11+('4. Bilan & ratios'!AP59-'4. Bilan & ratios'!AO59)","v":0},{"$f":"'3. CF'!AQ11+('4. Bilan & ratios'!AQ59-'4. Bilan & ratios'!AP59)","v":0},{"$f":"'3. CF'!AR11+('4. Bilan & ratios'!AR59-'4. Bilan & ratios'!AQ59)","v":0},{"$f":"'3. CF'!AS11+('4. Bilan & ratios'!AS59-'4. Bilan & ratios'!AR59)","v":0},{"$f":"'3. CF'!AT11+('4. Bilan & ratios'!AT59-'4. Bilan & ratios'!AS59)","v":0},{"$f":"'3. CF'!AU11+('4. Bilan & ratios'!AU59-'4. Bilan & ratios'!AT59)","v":0},{"$f":"'3. CF'!AV11+('4. Bilan & ratios'!AV59-'4. Bilan & ratios'!AU59)","v":0},{"$f":"'3. CF'!AW11+('4. Bilan & ratios'!AW59-'4. Bilan & ratios'!AV59)","v":0},{"$f":"'3. CF'!AX11+('4. Bilan & ratios'!AX59-'4. Bilan & ratios'!AW59)","v":0},{"$f":"'3. CF'!AY11+('4. Bilan & ratios'!AY59-'4. Bilan & ratios'!AX59)","v":0},{"$f":"'3. CF'!AZ11+('4. Bilan & ratios'!AZ59-'4. Bilan & ratios'!AY59)","v":0},{"$f":"'3. CF'!BA11+('4. Bilan & ratios'!BA59-'4. Bilan & ratios'!AZ59)","v":0},{"$f":"'3. CF'!BB11+('4. Bilan & ratios'!BB59-'4. Bilan & ratios'!BA59)","v":0},{"$f":"'3. CF'!BC11+('4. Bilan & ratios'!BC59-'4. Bilan & ratios'!BB59)","v":0},{"$f":"'3. CF'!BD11+('4. Bilan & ratios'!BD59-'4. Bilan & ratios'!BC59)","v":0},{"$f":"'3. CF'!BE11+('4. Bilan & ratios'!BE59-'4. Bilan & ratios'!BD59)","v":0},{"$f":"'3. CF'!BF11+('4. Bilan & ratios'!BF59-'4. Bilan & ratios'!BE59)","v":0},{"$f":"'3. CF'!BG11+('4. Bilan & ratios'!BG59-'4. Bilan & ratios'!BF59)","v":0},{"$f":"'3. CF'!BH11+('4. Bilan & ratios'!BH59-'4. Bilan & ratios'!BG59)","v":0},{"$f":"'3. CF'!BI11+('4. Bilan & ratios'!BI59-'4. Bilan & ratios'!BH59)","v":0},{"$f":"'3. CF'!BJ11+('4. Bilan & ratios'!BJ59-'4. Bilan & ratios'!BI59)","v":0},{"$f":"'3. CF'!BK11+('4. Bilan & ratios'!BK59-'4. Bilan & ratios'!BJ59)","v":0},{"$f":"'3. CF'!BL11+('4. Bilan & ratios'!BL59-'4. Bilan & ratios'!BK59)","v":0},{"$f":"'3. CF'!BM11+('4. Bilan & ratios'!BM59-'4. Bilan & ratios'!BL59)","v":0},{"$f":"'3. CF'!BN11+('4. Bilan & ratios'!BN59-'4. Bilan & ratios'!BM59)","v":0},{"$f":"'3. CF'!BO11+('4. Bilan & ratios'!BO59-'4. Bilan & ratios'!BN59)","v":0},{"$f":"'3. CF'!BP11+('4. Bilan & ratios'!BP59-'4. Bilan & ratios'!BO59)","v":0},{"$f":"'3. CF'!BQ11+('4. Bilan & ratios'!BQ59-'4. Bilan & ratios'!BP59)","v":0},{"$f":"'3. CF'!BR11+('4. Bilan & ratios'!BR59-'4. Bilan & ratios'!BQ59)","v":0},{"$f":"'3. CF'!BS11+('4. Bilan & ratios'!BS59-'4. Bilan & ratios'!BR59)","v":0},{"$f":"'3. CF'!BT11+('4. Bilan & ratios'!BT59-'4. Bilan & ratios'!BS59)","v":0},{"$f":"'3. CF'!BU11+('4. Bilan & ratios'!BU59-'4. Bilan & ratios'!BT59)","v":0},{"$f":"'3. CF'!BV11+('4. Bilan & ratios'!BV59-'4. Bilan & ratios'!BU59)","v":0},{"$f":"'3. CF'!BW11+('4. Bilan & ratios'!BW59-'4. Bilan & ratios'!BV59)","v":0},{"$f":"'3. CF'!BX11+('4. Bilan & ratios'!BX59-'4. Bilan & ratios'!BW59)","v":0},{"$f":"'3. CF'!BY11+('4. Bilan & ratios'!BY59-'4. Bilan & ratios'!BX59)","v":0},{"$f":"'3. CF'!BZ11+('4. Bilan & ratios'!BZ59-'4. Bilan & ratios'!BY59)","v":0},{"$f":"'3. CF'!CA11+('4. Bilan & ratios'!CA59-'4. Bilan & ratios'!BZ59)","v":0},{"$f":"'3. CF'!CB11+('4. Bilan & ratios'!CB59-'4. Bilan & ratios'!CA59)","v":0}]
[]
["Check mouvements de dette","Vérification que les mouvements de dette annuels expliquent la variation de dette financière au bilan",null,null,{"$f":"IF(ABS(SUM(F69:AB69))<10^-2, \"OK\", \"CHECK\")","v":"OK"},null,null,{"$f":"('3. CF'!H23+'3. CF'!H24)-('4. Bilan & ratios'!H40-'4. Bilan & ratios'!G40)","v":0},{"$f":"('3. CF'!I23+'3. CF'!I24)-('4. Bilan & ratios'!I40-'4. Bilan & ratios'!G40)","v":0},{"$f":"('3. CF'!J23+'3. CF'!J24)-('4. Bilan & ratios'!J40-'4. Bilan & ratios'!I40)","v":0},{"$f":"('3. CF'!K23+'3. CF'!K24)-('4. Bilan & ratios'!K40-'4. Bilan & ratios'!J40)","v":0},{"$f":"('3. CF'!L23+'3. CF'!L24)-('4. Bilan & ratios'!L40-'4. Bilan & ratios'!K40)","v":0},{"$f":"('3. CF'!M23+'3. CF'!M24)-('4. Bilan & ratios'!M40-'4. Bilan & ratios'!L40)","v":0},{"$f":"('3. CF'!N23+'3. CF'!N24)-('4. Bilan & ratios'!N40-'4. Bilan & ratios'!M40)","v":0},{"$f":"('3. CF'!O23+'3. CF'!O24)-('4. Bilan & ratios'!O40-'4. Bilan & ratios'!N40)","v":0},{"$f":"('3. CF'!P23+'3. CF'!P24)-('4. Bilan & ratios'!P40-'4. Bilan & ratios'!O40)","v":0},{"$f":"('3. CF'!Q23+'3. CF'!Q24)-('4. Bilan & ratios'!Q40-'4. Bilan & ratios'!P40)","v":0},{"$f":"('3. CF'!R23+'3. CF'!R24)-('4. Bilan & ratios'!R40-'4. Bilan & ratios'!Q40)","v":0},{"$f":"('3. CF'!S23+'3. CF'!S24)-('4. Bilan & ratios'!S40-'4. Bilan & ratios'!R40)","v":0},{"$f":"('3. CF'!T23+'3. CF'!T24)-('4. Bilan & ratios'!T40-'4. Bilan & ratios'!S40)","v":0},{"$f":"('3. CF'!U23+'3. CF'!U24)-('4. Bilan & ratios'!U40-'4. Bilan & ratios'!T40)","v":0},{"$f":"('3. CF'!V23+'3. CF'!V24)-('4. Bilan & ratios'!V40-'4. Bilan & ratios'!U40)","v":0},{"$f":"('3. CF'!W23+'3. CF'!W24)-('4. Bilan & ratios'!W40-'4. Bilan & ratios'!V40)","v":0},{"$f":"('3. CF'!X23+'3. CF'!X24)-('4. Bilan & ratios'!X40-'4. Bilan & ratios'!W40)","v":0},{"$f":"('3. CF'!Y23+'3. CF'!Y24)-('4. Bilan & ratios'!Y40-'4. Bilan & ratios'!X40)","v":0},{"$f":"('3. CF'!Z23+'3. CF'!Z24)-('4. Bilan & ratios'!Z40-'4. Bilan & ratios'!Y40)","v":0},{"$f":"('3. CF'!AA23+'3. CF'!AA24)-('4. Bilan & ratios'!AA40-'4. Bilan & ratios'!Z40)","v":0},{"$f":"('3. CF'!AB23+'3. CF'!AB24)-('4. Bilan & ratios'!AB40-'4. Bilan & ratios'!AA40)","v":0},{"$f":"('3. CF'!AC23+'3. CF'!AC24)-('4. Bilan & ratios'!AC40-'4. Bilan & ratios'!AB40)","v":0},{"$f":"('3. CF'!AD23+'3. CF'!AD24)-('4. Bilan & ratios'!AD40-'4. Bilan & ratios'!AC40)","v":0},{"$f":"('3. CF'!AE23+'3. CF'!AE24)-('4. Bilan & ratios'!AE40-'4. Bilan & ratios'!AD40)","v":0},{"$f":"('3. CF'!AF23+'3. CF'!AF24)-('4. Bilan & ratios'!AF40-'4. Bilan & ratios'!AE40)","v":0},{"$f":"('3. CF'!AG23+'3. CF'!AG24)-('4. Bilan & ratios'!AG40-'4. Bilan & ratios'!AF40)","v":0},{"$f":"('3. CF'!AH23+'3. CF'!AH24)-('4. Bilan & ratios'!AH40-'4. Bilan & ratios'!AG40)","v":0},{"$f":"('3. CF'!AI23+'3. CF'!AI24)-('4. Bilan & ratios'!AI40-'4. Bilan & ratios'!AH40)","v":0},{"$f":"('3. CF'!AJ23+'3. CF'!AJ24)-('4. Bilan & ratios'!AJ40-'4. Bilan & ratios'!AI40)","v":0},{"$f":"('3. CF'!AK23+'3. CF'!AK24)-('4. Bilan & ratios'!AK40-'4. Bilan & ratios'!AJ40)","v":0},{"$f":"('3. CF'!AL23+'3. CF'!AL24)-('4. Bilan & ratios'!AL40-'4. Bilan & ratios'!AK40)","v":0},{"$f":"('3. CF'!AM23+'3. CF'!AM24)-('4. Bilan & ratios'!AM40-'4. Bilan & ratios'!AL40)","v":0},{"$f":"('3. CF'!AN23+'3. CF'!AN24)-('4. Bilan & ratios'!AN40-'4. Bilan & ratios'!AM40)","v":0},{"$f":"('3. CF'!AO23+'3. CF'!AO24)-('4. Bilan & ratios'!AO40-'4. Bilan & ratios'!AN40)","v":0},{"$f":"('3. CF'!AP23+'3. CF'!AP24)-('4. Bilan & ratios'!AP40-'4. Bilan & ratios'!AO40)","v":0},{"$f":"('3. CF'!AQ23+'3. CF'!AQ24)-('4. Bilan & ratios'!AQ40-'4. Bilan & ratios'!AP40)","v":0},{"$f":"('3. CF'!AR23+'3. CF'!AR24)-('4. Bilan & ratios'!AR40-'4. Bilan & ratios'!AQ40)","v":0},{"$f":"('3. CF'!AS23+'3. CF'!AS24)-('4. Bilan & ratios'!AS40-'4. Bilan & ratios'!AR40)","v":0},{"$f":"('3. CF'!AT23+'3. CF'!AT24)-('4. Bilan & ratios'!AT40-'4. Bilan & ratios'!AS40)","v":0},{"$f":"('3. CF'!AU23+'3. CF'!AU24)-('4. Bilan & ratios'!AU40-'4. Bilan & ratios'!AT40)","v":0},{"$f":"('3. CF'!AV23+'3. CF'!AV24)-('4. Bilan & ratios'!AV40-'4. Bilan & ratios'!AU40)","v":0},{"$f":"('3. CF'!AW23+'3. CF'!AW24)-('4. Bilan & ratios'!AW40-'4. Bilan & ratios'!AV40)","v":0},{"$f":"('3. CF'!AX23+'3. CF'!AX24)-('4. Bilan & ratios'!AX40-'4. Bilan & ratios'!AW40)","v":0},{"$f":"('3. CF'!AY23+'3. CF'!AY24)-('4. Bilan & ratios'!AY40-'4. Bilan & ratios'!AX40)","v":0},{"$f":"('3. CF'!AZ23+'3. CF'!AZ24)-('4. Bilan & ratios'!AZ40-'4. Bilan & ratios'!AY40)","v":0},{"$f":"('3. CF'!BA23+'3. CF'!BA24)-('4. Bilan & ratios'!BA40-'4. Bilan & ratios'!AZ40)","v":0},{"$f":"('3. CF'!BB23+'3. CF'!BB24)-('4. Bilan & ratios'!BB40-'4. Bilan & ratios'!BA40)","v":0},{"$f":"('3. CF'!BC23+'3. CF'!BC24)-('4. Bilan & ratios'!BC40-'4. Bilan & ratios'!BB40)","v":0},{"$f":"('3. CF'!BD23+'3. CF'!BD24)-('4. Bilan & ratios'!BD40-'4. Bilan & ratios'!BC40)","v":0},{"$f":"('3. CF'!BE23+'3. CF'!BE24)-('4. Bilan & ratios'!BE40-'4. Bilan & ratios'!BD40)","v":0},{"$f":"('3. CF'!BF23+'3. CF'!BF24)-('4. Bilan & ratios'!BF40-'4. Bilan & ratios'!BE40)","v":0},{"$f":"('3. CF'!BG23+'3. CF'!BG24)-('4. Bilan & ratios'!BG40-'4. Bilan & ratios'!BF40)","v":0},{"$f":"('3. CF'!BH23+'3. CF'!BH24)-('4. Bilan & ratios'!BH40-'4. Bilan & ratios'!BG40)","v":0},{"$f":"('3. CF'!BI23+'3. CF'!BI24)-('4. Bilan & ratios'!BI40-'4. Bilan & ratios'!BH40)","v":0},{"$f":"('3. CF'!BJ23+'3. CF'!BJ24)-('4. Bilan & ratios'!BJ40-'4. Bilan & ratios'!BI40)","v":0},{"$f":"('3. CF'!BK23+'3. CF'!BK24)-('4. Bilan & ratios'!BK40-'4. Bilan & ratios'!BJ40)","v":0},{"$f":"('3. CF'!BL23+'3. CF'!BL24)-('4. Bilan & ratios'!BL40-'4. Bilan & ratios'!BK40)","v":0},{"$f":"('3. CF'!BM23+'3. CF'!BM24)-('4. Bilan & ratios'!BM40-'4. Bilan & ratios'!BL40)","v":0},{"$f":"('3. CF'!BN23+'3. CF'!BN24)-('4. Bilan & ratios'!BN40-'4. Bilan & ratios'!BM40)","v":0},{"$f":"('3. CF'!BO23+'3. CF'!BO24)-('4. Bilan & ratios'!BO40-'4. Bilan & ratios'!BN40)","v":0},{"$f":"('3. CF'!BP23+'3. CF'!BP24)-('4. Bilan & ratios'!BP40-'4. Bilan & ratios'!BO40)","v":0},{"$f":"('3. CF'!BQ23+'3. CF'!BQ24)-('4. Bilan & ratios'!BQ40-'4. Bilan & ratios'!BP40)","v":0},{"$f":"('3. CF'!BR23+'3. CF'!BR24)-('4. Bilan & ratios'!BR40-'4. Bilan & ratios'!BQ40)","v":0},{"$f":"('3. CF'!BS23+'3. CF'!BS24)-('4. Bilan & ratios'!BS40-'4. Bilan & ratios'!BR40)","v":0},{"$f":"('3. CF'!BT23+'3. CF'!BT24)-('4. Bilan & ratios'!BT40-'4. Bilan & ratios'!BS40)","v":0},{"$f":"('3. CF'!BU23+'3. CF'!BU24)-('4. Bilan & ratios'!BU40-'4. Bilan & ratios'!BT40)","v":0},{"$f":"('3. CF'!BV23+'3. CF'!BV24)-('4. Bilan & ratios'!BV40-'4. Bilan & ratios'!BU40)","v":0},{"$f":"('3. CF'!BW23+'3. CF'!BW24)-('4. Bilan & ratios'!BW40-'4. Bilan & ratios'!BV40)","v":0},{"$f":"('3. CF'!BX23+'3. CF'!BX24)-('4. Bilan & ratios'!BX40-'4. Bilan & ratios'!BW40)","v":0},{"$f":"('3. CF'!BY23+'3. CF'!BY24)-('4. Bilan & ratios'!BY40-'4. Bilan & ratios'!BX40)","v":0},{"$f":"('3. CF'!BZ23+'3. CF'!BZ24)-('4. Bilan & ratios'!BZ40-'4. Bilan & ratios'!BY40)","v":0},{"$f":"('3. CF'!CA23+'3. CF'!CA24)-('4. Bilan & ratios'!CA40-'4. Bilan & ratios'!BZ40)","v":0},{"$f":"('3. CF'!CB23+'3. CF'!CB24)-('4. Bilan & ratios'!CB40-'4. Bilan & ratios'!CA40)","v":0}]
[]
["Réconciliation des Immobilisations corporelles et incorporelles au bilan",null,null,null,null,null,null,null,null,{"$f":"('4. Bilan & ratios'!I8+'4. Bilan & ratios'!I9)-'3. CF'!J13+'2. P&L'!J78","v":0},{"$f":"J71-'3. CF'!K13+'2. P&L'!K78","v":0},{"$f":"K71-'3. CF'!L13+'2. P&L'!L78","v":0},{"$f":"L71-'3. CF'!M13+'2. P&L'!M78","v":0},{"$f":"M71-'3. CF'!N13+'2. P&L'!N78","v":0},{"$f":"N71-'3. CF'!O13+'2. P&L'!O78","v":0},{"$f":"O71-'3. CF'!P13+'2. P&L'!P78","v":0},{"$f":"P71-'3. CF'!Q13+'2. P&L'!Q78","v":0},{"$f":"Q71-'3. CF'!R13+'2. P&L'!R78","v":0},{"$f":"R71-'3. CF'!S13+'2. P&L'!S78","v":0},{"$f":"S71-'3. CF'!T13+'2. P&L'!T78","v":0},{"$f":"T71-'3. CF'!U13+'2. P&L'!U78","v":0},{"$f":"U71-'3. CF'!V13+'2. P&L'!V78","v":0},{"$f":"V71-'3. CF'!W13+'2. P&L'!W78","v":0},{"$f":"W71-'3. CF'!X13+'2. P&L'!X78","v":0},{"$f":"X71-'3. CF'!Y13+'2. P&L'!Y78","v":0},{"$f":"Y71-'3. CF'!Z13+'2. P&L'!Z78","v":0},{"$f":"Z71-'3. CF'!AA13+'2. P&L'!AA78","v":0},{"$f":"AA71-'3. CF'!AB13+'2. P&L'!AB78","v":0},{"$f":"AB71-'3. CF'!AC13+'2. P&L'!AC78","v":0},{"$f":"AC71-'3. CF'!AD13+'2. P&L'!AD78","v":0},{"$f":"AD71-'3. CF'!AE13+'2. P&L'!AE78","v":0},{"$f":"AE71-'3. CF'!AF13+'2. P&L'!AF78","v":0},{"$f":"AF71-'3. CF'!AG13+'2. P&L'!AG78","v":0},{"$f":"AG71-'3. CF'!AH13+'2. P&L'!AH78","v":0},{"$f":"AH71-'3. CF'!AI13+'2. P&L'!AI78","v":0},{"$f":"AI71-'3. CF'!AJ13+'2. P&L'!AJ78","v":0},{"$f":"AJ71-'3. CF'!AK13+'2. P&L'!AK78","v":0},{"$f":"AK71-'3. CF'!AL13+'2. P&L'!AL78","v":0},{"$f":"AL71-'3. CF'!AM13+'2. P&L'!AM78","v":0},{"$f":"AM71-'3. CF'!AN13+'2. P&L'!AN78","v":0},{"$f":"AN71-'3. CF'!AO13+'2. P&L'!AO78","v":0},{"$f":"AO71-'3. CF'!AP13+'2. P&L'!AP78","v":0},{"$f":"AP71-'3. CF'!AQ13+'2. P&L'!AQ78","v":0},{"$f":"AQ71-'3. CF'!AR13+'2. P&L'!AR78","v":0},{"$f":"AR71-'3. CF'!AS13+'2. P&L'!AS78","v":0},{"$f":"AS71-'3. CF'!AT13+'2. P&L'!AT78","v":0},{"$f":"AT71-'3. CF'!AU13+'2. P&L'!AU78","v":0},{"$f":"AU71-'3. CF'!AV13+'2. P&L'!AV78","v":0},{"$f":"AV71-'3. CF'!AW13+'2. P&L'!AW78","v":0},{"$f":"AW71-'3. CF'!AX13+'2. P&L'!AX78","v":0},{"$f":"AX71-'3. CF'!AY13+'2. P&L'!AY78","v":0},{"$f":"AY71-'3. CF'!AZ13+'2. P&L'!AZ78","v":0},{"$f":"AZ71-'3. CF'!BA13+'2. P&L'!BA78","v":0},{"$f":"BA71-'3. CF'!BB13+'2. P&L'!BB78","v":0},{"$f":"BB71-'3. CF'!BC13+'2. P&L'!BC78","v":0},{"$f":"BC71-'3. CF'!BD13+'2. P&L'!BD78","v":0},{"$f":"BD71-'3. CF'!BE13+'2. P&L'!BE78","v":0},{"$f":"BE71-'3. CF'!BF13+'2. P&L'!BF78","v":0},{"$f":"BF71-'3. CF'!BG13+'2. P&L'!BG78","v":0},{"$f":"BG71-'3. CF'!BH13+'2. P&L'!BH78","v":0},{"$f":"BH71-'3. CF'!BI13+'2. P&L'!BI78","v":0},{"$f":"BI71-'3. CF'!BJ13+'2. P&L'!BJ78","v":0},{"$f":"BJ71-'3. CF'!BK13+'2. P&L'!BK78","v":0},{"$f":"BK71-'3. CF'!BL13+'2. P&L'!BL78","v":0},{"$f":"BL71-'3. CF'!BM13+'2. P&L'!BM78","v":0},{"$f":"BM71-'3. CF'!BN13+'2. P&L'!BN78","v":0},{"$f":"BN71-'3. CF'!BO13+'2. P&L'!BO78","v":0},{"$f":"BO71-'3. CF'!BP13+'2. P&L'!BP78","v":0},{"$f":"BP71-'3. CF'!BQ13+'2. P&L'!BQ78","v":0},{"$f":"BQ71-'3. CF'!BR13+'2. P&L'!BR78","v":0},{"$f":"BR71-'3. CF'!BS13+'2. P&L'!BS78","v":0},{"$f":"BS71-'3. CF'!BT13+'2. P&L'!BT78","v":0},{"$f":"BT71-'3. CF'!BU13+'2. P&L'!BU78","v":0},{"$f":"BU71-'3. CF'!BV13+'2. P&L'!BV78","v":0},{"$f":"BV71-'3. CF'!BW13+'2. P&L'!BW78","v":0},{"$f":"BW71-'3. CF'!BX13+'2. P&L'!BX78","v":0},{"$f":"BX71-'3. CF'!BY13+'2. P&L'!BY78","v":0},{"$f":"BY71-'3. CF'!BZ13+'2. P&L'!BZ78","v":0},{"$f":"BZ71-'3. CF'!CA13+'2. P&L'!CA78","v":0},{"$f":"CA71-'3. CF'!CB13+'2. P&L'!CB78","v":0}]
["Check réconciliation immobilisations incorporelles et corporelles","Cohérence des mouvements d'immobilisations au bilan avec les investissements réels (Pg investissements) et prévisionnels (CF) et les amortissements (P&L)",null,null,{"$f":"IF(ABS(SUM(F72:AB72))<10^-2, \"OK\", \"CHECK\")","v":"OK"},null,null,null,{"$f":"('4. Bilan & ratios'!I8-'4. Bilan & ratios'!G8)-('5. Investissements'!I96+'2. P&L'!I78)","v":0},{"$f":"J71-('4. Bilan & ratios'!J8+'4. Bilan & ratios'!J9)","v":0},{"$f":"K71-('4. Bilan & ratios'!K8+'4. Bilan & ratios'!K9)","v":0},{"$f":"L71-('4. Bilan & ratios'!L8+'4. Bilan & ratios'!L9)","v":0},{"$f":"M71-('4. Bilan & ratios'!M8+'4. Bilan & ratios'!M9)","v":0},{"$f":"N71-('4. Bilan & ratios'!N8+'4. Bilan & ratios'!N9)","v":0},{"$f":"O71-('4. Bilan & ratios'!O8+'4. Bilan & ratios'!O9)","v":0},{"$f":"P71-('4. Bilan & ratios'!P8+'4. Bilan & ratios'!P9)","v":0},{"$f":"Q71-('4. Bilan & ratios'!Q8+'4. Bilan & ratios'!Q9)","v":0},{"$f":"R71-('4. Bilan & ratios'!R8+'4. Bilan & ratios'!R9)","v":0},{"$f":"S71-('4. Bilan & ratios'!S8+'4. Bilan & ratios'!S9)","v":0},{"$f":"T71-('4. Bilan & ratios'!T8+'4. Bilan & ratios'!T9)","v":0},{"$f":"U71-('4. Bilan & ratios'!U8+'4. Bilan & ratios'!U9)","v":0},{"$f":"V71-('4. Bilan & ratios'!V8+'4. Bilan & ratios'!V9)","v":0},{"$f":"W71-('4. Bilan & ratios'!W8+'4. Bilan & ratios'!W9)","v":0},{"$f":"X71-('4. Bilan & ratios'!X8+'4. Bilan & ratios'!X9)","v":0},{"$f":"Y71-('4. Bilan & ratios'!Y8+'4. Bilan & ratios'!Y9)","v":0},{"$f":"Z71-('4. Bilan & ratios'!Z8+'4. Bilan & ratios'!Z9)","v":0},{"$f":"AA71-('4. Bilan & ratios'!AA8+'4. Bilan & ratios'!AA9)","v":0},{"$f":"AB71-('4. Bilan & ratios'!AB8+'4. Bilan & ratios'!AB9)","v":0},{"$f":"AC71-('4. Bilan & ratios'!AC8+'4. Bilan & ratios'!AC9)","v":0},{"$f":"AD71-('4. Bilan & ratios'!AD8+'4. Bilan & ratios'!AD9)","v":0},{"$f":"AE71-('4. Bilan & ratios'!AE8+'4. Bilan & ratios'!AE9)","v":0},{"$f":"AF71-('4. Bilan & ratios'!AF8+'4. Bilan & ratios'!AF9)","v":0},{"$f":"AG71-('4. Bilan & ratios'!AG8+'4. Bilan & ratios'!AG9)","v":0},{"$f":"AH71-('4. Bilan & ratios'!AH8+'4. Bilan & ratios'!AH9)","v":0},{"$f":"AI71-('4. Bilan & ratios'!AI8+'4. Bilan & ratios'!AI9)","v":0},{"$f":"AJ71-('4. Bilan & ratios'!AJ8+'4. Bilan & ratios'!AJ9)","v":0},{"$f":"AK71-('4. Bilan & ratios'!AK8+'4. Bilan & ratios'!AK9)","v":0},{"$f":"AL71-('4. Bilan & ratios'!AL8+'4. Bilan & ratios'!AL9)","v":0},{"$f":"AM71-('4. Bilan & ratios'!AM8+'4. Bilan & ratios'!AM9)","v":0},{"$f":"AN71-('4. Bilan & ratios'!AN8+'4. Bilan & ratios'!AN9)","v":0},{"$f":"AO71-('4. Bilan & ratios'!AO8+'4. Bilan & ratios'!AO9)","v":0},{"$f":"AP71-('4. Bilan & ratios'!AP8+'4. Bilan & ratios'!AP9)","v":0},{"$f":"AQ71-('4. Bilan & ratios'!AQ8+'4. Bilan & ratios'!AQ9)","v":0},{"$f":"AR71-('4. Bilan & ratios'!AR8+'4. Bilan & ratios'!AR9)","v":0},{"$f":"AS71-('4. Bilan & ratios'!AS8+'4. Bilan & ratios'!AS9)","v":0},{"$f":"AT71-('4. Bilan & ratios'!AT8+'4. Bilan & ratios'!AT9)","v":0},{"$f":"AU71-('4. Bilan & ratios'!AU8+'4. Bilan & ratios'!AU9)","v":0},{"$f":"AV71-('4. Bilan & ratios'!AV8+'4. Bilan & ratios'!AV9)","v":0},{"$f":"AW71-('4. Bilan & ratios'!AW8+'4. Bilan & ratios'!AW9)","v":0},{"$f":"AX71-('4. Bilan & ratios'!AX8+'4. Bilan & ratios'!AX9)","v":0},{"$f":"AY71-('4. Bilan & ratios'!AY8+'4. Bilan & ratios'!AY9)","v":0},{"$f":"AZ71-('4. Bilan & ratios'!AZ8+'4. Bilan & ratios'!AZ9)","v":0},{"$f":"BA71-('4. Bilan & ratios'!BA8+'4. Bilan & ratios'!BA9)","v":0},{"$f":"BB71-('4. Bilan & ratios'!BB8+'4. Bilan & ratios'!BB9)","v":0},{"$f":"BC71-('4. Bilan & ratios'!BC8+'4. Bilan & ratios'!BC9)","v":0},{"$f":"BD71-('4. Bilan & ratios'!BD8+'4. Bilan & ratios'!BD9)","v":0},{"$f":"BE71-('4. Bilan & ratios'!BE8+'4. Bilan & ratios'!BE9)","v":0},{"$f":"BF71-('4. Bilan & ratios'!BF8+'4. Bilan & ratios'!BF9)","v":0},{"$f":"BG71-('4. Bilan & ratios'!BG8+'4. Bilan & ratios'!BG9)","v":0},{"$f":"BH71-('4. Bilan & ratios'!BH8+'4. Bilan & ratios'!BH9)","v":0},{"$f":"BI71-('4. Bilan & ratios'!BI8+'4. Bilan & ratios'!BI9)","v":0},{"$f":"BJ71-('4. Bilan & ratios'!BJ8+'4. Bilan & ratios'!BJ9)","v":0},{"$f":"BK71-('4. Bilan & ratios'!BK8+'4. Bilan & ratios'!BK9)","v":0},{"$f":"BL71-('4. Bilan & ratios'!BL8+'4. Bilan & ratios'!BL9)","v":0},{"$f":"BM71-('4. Bilan & ratios'!BM8+'4. Bilan & ratios'!BM9)","v":0},{"$f":"BN71-('4. Bilan & ratios'!BN8+'4. Bilan & ratios'!BN9)","v":0},{"$f":"BO71-('4. Bilan & ratios'!BO8+'4. Bilan & ratios'!BO9)","v":0},{"$f":"BP71-('4. Bilan & ratios'!BP8+'4. Bilan & ratios'!BP9)","v":0},{"$f":"BQ71-('4. Bilan & ratios'!BQ8+'4. Bilan & ratios'!BQ9)","v":0},{"$f":"BR71-('4. Bilan & ratios'!BR8+'4. Bilan & ratios'!BR9)","v":0},{"$f":"BS71-('4. Bilan & ratios'!BS8+'4. Bilan & ratios'!BS9)","v":0},{"$f":"BT71-('4. Bilan & ratios'!BT8+'4. Bilan & ratios'!BT9)","v":0},{"$f":"BU71-('4. Bilan & ratios'!BU8+'4. Bilan & ratios'!BU9)","v":0},{"$f":"BV71-('4. Bilan & ratios'!BV8+'4. Bilan & ratios'!BV9)","v":0},{"$f":"BW71-('4. Bilan & ratios'!BW8+'4. Bilan & ratios'!BW9)","v":0},{"$f":"BX71-('4. Bilan & ratios'!BX8+'4. Bilan & ratios'!BX9)","v":0},{"$f":"BY71-('4. Bilan & ratios'!BY8+'4. Bilan & ratios'!BY9)","v":0},{"$f":"BZ71-('4. Bilan & ratios'!BZ8+'4. Bilan & ratios'!BZ9)","v":0},{"$f":"CA71-('4. Bilan & ratios'!CA8+'4. Bilan & ratios'!CA9)","v":0},{"$f":"CB71-('4. Bilan & ratios'!CB8+'4. Bilan & ratios'!CB9)","v":0}]

{"sheet":"10. Bridge 2015 (ARAFER)","index":10,"n_rows":192,"n_cols":13,"rows_kept":192,"cut":false,"hidden":true,"merged":[[25,1,25,4],[108,1,108,4],[141,1,141,4]]}
[null,{"$f":"'1. Info'!$D$5","v":0}]
[]
[null,null,"2015 (p) n-2","2015 (p) n-1","2015 (r)",null,"Ecart 2015 (p) n-1/ 2015(p) n-2 en M€","Ecart en %",null,"Ecart 2015 (r ) / 2015 (p) n-1 en M€","Ecart en %"]
[null,"Prix "]
[null,"Evolution Inflation utilisée dans la loi tarifaire en %",null,{"$f":"'2. P&L'!F7","v":0},{"$f":"'2. P&L'!G7","v":0},null,null,{"$f":"IFERROR(D5/C5-1,\"\")","v":""},null,null,{"$f":"IFERROR(E5/D5-1,\"\")","v":""}]
[null,"Evolution Inflation générale en %",null,{"$f":"'2. P&L'!F8","v":0},{"$f":"'2. P&L'!G8","v":0},null,null,{"$f":"IFERROR(D6/C6-1,\"\")","v":""},null,null,""]
[null,"Evolution TP01 en %",null,{"$f":"'2. P&L'!F9","v":0},{"$f":"'2. P&L'!G9","v":0},null,null,"",null,null,""]
[null,"Evolution TP09 en %",null,{"$f":"'2. P&L'!F10","v":0},{"$f":"'2. P&L'!G10","v":0},null,null,"",null,null,""]
[null,null,null,null,null,null,null,"",null,null,""]
[null,"Trafics",null,null,null,null,null,""]
[null,"Evolution Trafic  en % réseau payant",null,{"$f":"'2. P&L'!F13","v":0},{"$f":"'2. P&L'!G13","v":0},null,null,"",null,null,""]
[null,"Evolution Trafic VL en % réseau payant",null,{"$f":"'2. P&L'!F14","v":0},{"$f":"'2. P&L'!G14","v":0},null,null,"",null,null,""]
[null,"Evolution Trafic PL en % réseau payant",null,{"$f":"'2. P&L'!F15","v":0},{"$f":"'2. P&L'!G15","v":0},null,null,"",null,null,""]
[null,null,null,null,null,null,null,"",null,null,""]
[null,"Tarifs",null,null,null,null,null,""]
[null,"Evolution tarifs théorique Classe 1 en %",null,{"$f":"'2. P&L'!F18","v":0},{"$f":"'2. P&L'!G18","v":0},null,null,"",null,null,""]
[null,"Evolution tarifs théorique Classe 2 en %",null,{"$f":"'2. P&L'!F19","v":0},{"$f":"'2. P&L'!G19","v":0},null,null,"",null,null,""]
[null,"Evolution tarifs théorique Classe 3 en %",null,{"$f":"'2. P&L'!F20","v":0},{"$f":"'2. P&L'!G20","v":0},null,null,"",null,null,""]
[null,"Evolution tarifs théorique Classe 4 en %",null,{"$f":"'2. P&L'!F21","v":0},{"$f":"'2. P&L'!G21","v":0},null,null,"",null,null,""]
[null,"Evolution tarifs théorique Classe 5 en %",null,{"$f":"'2. P&L'!F22","v":0},{"$f":"'2. P&L'!G22","v":0},null,null,"",null,null,""]
[null,"Evolution tarifs réel en %",null,{"$f":"'2. P&L'!F24","v":0},{"$f":"'2. P&L'!G24","v":0},null,null,"",null,null,""]
[null,"Evolution tarifs réel VL en %",null,{"$f":"'2. P&L'!F25","v":0},{"$f":"'2. P&L'!G25","v":0},null,null,"",null,null,""]
[null,"Evolution tarifs réel PL en %",null,{"$f":"'2. P&L'!F26","v":0},{"$f":"'2. P&L'!G26","v":0},null,null,"",null,null,""]
[null,null,null,null,null,null,null,"",null,null,""]
[]
[null,"Compte de Résultat"]
[]
[null,"( en M€ courants )  ","2015 (p) n-2","2015 (p) n-1","2015 (r)",null,"Ecart en M€","Ecart en %",null,"Ecart en M€","Ecart en %",null,"Matérialité des données"]
[]
[null,"CHIFFRES D'AFFAIRES",null,{"$f":"'2. P&L'!F32","v":0},{"$f":"+E31+E36","v":0},null,{"$f":"D30-C30","v":0},{"$f":"IFERROR(D30/C30-1,\"\")","v":""},null,{"$f":"E30-D30","v":0},{"$f":"IFERROR(E30/D30-1,\"\")","v":""}]
[null,"Chiffre d'Affaires péage net",null,{"$f":"'2. P&L'!F33","v":0},{"$f":"'2. P&L'!G33","v":0},null,{"$f":"D31-C31","v":0},"",null,{"$f":"E31-D31","v":0},"",null,{"$f":"IF(ABS(E31/$E$72)>'1. Info'!$D$24,\"SIGNIFICATIF\",\"NON MATERIEL\")","v":{"$error":"#DIV/0!"}}]
[null,"% Evolution",null,null,null,null,null,"",null,null,""]
[null,"dont CA net VL",null,null,null,null,null,"",null,null,""]
[null,"dont CA net PL",null,null,null,null,null,"",null,null,""]
[null,null,null,null,null,null,null,""]
[null,"Revenus des activités annexes",null,{"$f":"'2. P&L'!F40","v":0},{"$f":"SUM(E37:E39)","v":0},null,{"$f":"D36-C36","v":0},"",null,{"$f":"E36-D36","v":0},{"$f":"IFERROR(E36/D36-1,\"\")","v":""},null,{"$f":"IF(ABS(E36/$E$72)>'1. Info'!$D$24,\"\",\"NON MATERIEL\")","v":{"$error":"#DIV/0!"}}]
[null," Redevances des installations commerciales",null,{"$f":"'2. P&L'!F41","v":0},{"$f":"'2. P&L'!G41","v":0},null,0,"",null,0,"",null,{"$f":"IF(ABS(E37/$E$72)>'1. Info'!$D$24,\"SIGNIFICATIF\",\"NON MATERIEL\")","v":{"$error":"#DIV/0!"}}]
[null," Redevances des installations de télécommunication",null,{"$f":"'2. P&L'!F42","v":0},{"$f":"'2. P&L'!G42","v":0},null,0,"",null,0,"",null,{"$f":"IF(ABS(E38/$E$72)>'1. Info'!$D$24,\"SIGNIFICATIF\",\"NON MATERIEL\")","v":{"$error":"#DIV/0!"}}]
[null," Autres éléments du chiffre d'affaires",null,{"$f":"'2. P&L'!F43","v":0},{"$f":"'2. P&L'!G43","v":0},null,0,"",null,0,"",null,{"$f":"IF(ABS(E39/$E$72)>'1. Info'!$D$24,\"SIGNIFICATIF\",\"NON MATERIEL\")","v":{"$error":"#DIV/0!"}}]
[null,"AUTRES REVENUS D'EXPLOITATION",null,{"$f":"'2. P&L'!F44","v":0},{"$f":"SUM(E41:E44)","v":0},null,0,"",null,0,""]
[null,"Production Immobilisée",null,null,{"$f":"'2. P&L'!G45","v":0},null,0,"",null,0,"",null,{"$f":"IF(ABS(E41/$E$72)>'1. Info'!$D$24,\"SIGNIFICATIF\",\"NON MATERIEL\")","v":{"$error":"#DIV/0!"}}]
[null,"Remboursement accidents",null,null,{"$f":"'2. P&L'!G46","v":0},null,0,"",null,0,"",null,{"$f":"IF(ABS(E42/$E$72)>'1. Info'!$D$24,\"SIGNIFICATIF\",\"NON MATERIEL\")","v":{"$error":"#DIV/0!"}}]
[null,"Subventions d'exploitation",null,null,{"$f":"'2. P&L'!G47","v":0},null,0,"",null,0,"",null,{"$f":"IF(ABS(E43/$E$72)>'1. Info'!$D$24,\"SIGNIFICATIF\",\"NON MATERIEL\")","v":{"$error":"#DIV/0!"}}]
[null,"Autres produits d'exploitation",null,null,{"$f":"'2. P&L'!G48","v":0},null,0,"",null,0,"",null,{"$f":"IF(ABS(E44/$E$72)>'1. Info'!$D$24,\"SIGNIFICATIF\",\"NON MATERIEL\")","v":{"$error":"#DIV/0!"}}]
[null,"CHARGES D'EXPLOITATION",null,{"$f":"'2. P&L'!F49","v":0},{"$f":"E46+E58+E64+E71","v":0},null,0,"",null,0,""]
[null,"Achats et charges externes",null,{"$f":"'2. P&L'!F50","v":0},{"$f":"+E47+E48+E52+E53+E56","v":0},null,0,"",null,0,""]
[null,"Energie, achats stockés et consommables",null,{"$f":"'2. P&L'!F51","v":0},{"$f":"'2. P&L'!G51","v":0},null,0,"",null,0,"",null,{"$f":"IF(ABS(E47/$E$72)>'1. Info'!$D$24,\"SIGNIFICATIF\",\"NON MATERIEL\")","v":{"$error":"#DIV/0!"}}]
[null,"Gros entretien sur infrastructures",null,{"$f":"'2. P&L'!F52","v":0},{"$f":"'2. P&L'!G52","v":0},null,0,"",null,0,"",null,{"$f":"IF(ABS(E48/$E$72)>'1. Info'!$D$24,\"SIGNIFICATIF\",\"NON MATERIEL\")","v":{"$error":"#DIV/0!"}}]
[null,"dont gros entretien sur chaussées ",null,null,{"$f":"'2. P&L'!G53","v":0},null,0,"",null,0,"",null,{"$f":"IF(ABS(E49/$E$72)>'1. Info'!$D$24,\"SIGNIFICATIF\",\"NON MATERIEL\")","v":{"$error":"#DIV/0!"}}]
[null,"dont gros entretien sur ouvrages d'art",null,null,{"$f":"'2. P&L'!G54","v":0},null,0,"",null,0,"",null,{"$f":"IF(ABS(E50/$E$72)>'1. Info'!$D$24,\"SIGNIFICATIF\",\"NON MATERIEL\")","v":{"$error":"#DIV/0!"}}]
[null,"dont autre gros entretien",null,null,{"$f":"'2. P&L'!G55","v":0},null,0,"",null,0,"",null,{"$f":"IF(ABS(E51/$E$72)>'1. Info'!$D$24,\"SIGNIFICATIF\",\"NON MATERIEL\")","v":{"$error":"#DIV/0!"}}]
[null,"Entretien courant",null,{"$f":"'2. P&L'!F56","v":0},{"$f":"'2. P&L'!G56","v":0},null,0,"",null,0,"",null,{"$f":"IF(ABS(E52/$E$72)>'1. Info'!$D$24,\"SIGNIFICATIF\",\"NON MATERIEL\")","v":{"$error":"#DIV/0!"}}]
[null,"Redevance domaniale",null,{"$f":"'2. P&L'!F57","v":0},{"$f":"'2. P&L'!G57","v":0},null,0,"",null,0,"",null,{"$f":"IF(ABS(E53/$E$72)>'1. Info'!$D$24,\"SIGNIFICATIF\",\"NON MATERIEL\")","v":{"$error":"#DIV/0!"}}]
[null,"Charge redevance domaniale brute comptabilisée",null,{"$f":"'2. P&L'!F58","v":0},{"$f":"'2. P&L'!G58","v":0},null,0,"",null,0,"",null,{"$f":"IF(ABS(E54/$E$72)>'1. Info'!$D$24,\"SIGNIFICATIF\",\"NON MATERIEL\")","v":{"$error":"#DIV/0!"}}]
[null,"Remboursement reçu de l'état au titre de la redevance domaniale ",null,{"$f":"'2. P&L'!F59","v":0},{"$f":"'2. P&L'!G59","v":0},null,0,"",null,0,"",null,{"$f":"IF(ABS(E55/$E$72)>'1. Info'!$D$24,\"SIGNIFICATIF\",\"NON MATERIEL\")","v":{"$error":"#DIV/0!"}}]
[null,"Autres prestations et charges externes",null,{"$f":"'2. P&L'!F60","v":0},{"$f":"'2. P&L'!G60","v":0},null,0,"",null,0,"",null,{"$f":"IF(ABS(E56/$E$72)>'1. Info'!$D$24,\"SIGNIFICATIF\",\"NON MATERIEL\")","v":{"$error":"#DIV/0!"}}]
[null,"dont contrat d'exploitation",null,{"$f":"'2. P&L'!F61","v":0},{"$f":"'2. P&L'!G61","v":0},null,0,"",null,0,"",null,{"$f":"IF(ABS(E57/$E$72)>'1. Info'!$D$24,\"SIGNIFICATIF\",\"NON MATERIEL\")","v":{"$error":"#DIV/0!"}}]
[null,"Charges de personnel (yc participation et CICE)",null,{"$f":"'2. P&L'!F62","v":0},{"$f":"SUM(E59:E63)","v":0},null,0,"",null,0,""]
[null,"Salaires et traitements",null,null,{"$f":"'2. P&L'!G63","v":0},null,0,"",null,0,"",null,{"$f":"IF(ABS(E59/$E$72)>'1. Info'!$D$24,\"SIGNIFICATIF\",\"NON MATERIEL\")","v":{"$error":"#DIV/0!"}}]
[null,"Charges sociales et engagements sociaux différés",null,null,{"$f":"'2. P&L'!G64","v":0},null,0,"",null,0,"",null,{"$f":"IF(ABS(E60/$E$72)>'1. Info'!$D$24,\"SIGNIFICATIF\",\"NON MATERIEL\")","v":{"$error":"#DIV/0!"}}]
[null,"Intéressement, abondement du plan d'épargne et participation",null,null,{"$f":"'2. P&L'!G65","v":0},null,0,"",null,0,"",null,{"$f":"IF(ABS(E61/$E$72)>'1. Info'!$D$24,\"SIGNIFICATIF\",\"NON MATERIEL\")","v":{"$error":"#DIV/0!"}}]
[null,"CICE",null,null,{"$f":"'2. P&L'!G66","v":0},null,0,"",null,0,"",null,{"$f":"IF(ABS(E62/$E$72)>'1. Info'!$D$24,\"SIGNIFICATIF\",\"NON MATERIEL\")","v":{"$error":"#DIV/0!"}}]
[null,"Autres charges de personnel",null,null,{"$f":"'2. P&L'!G67","v":0},null,0,"",null,0,"",null,{"$f":"IF(ABS(E63/$E$72)>'1. Info'!$D$24,\"SIGNIFICATIF\",\"NON MATERIEL\")","v":{"$error":"#DIV/0!"}}]
[null,"Impôts et taxes",null,{"$f":"'2. P&L'!F68","v":0},{"$f":"+E65+E68+E69+E70","v":0},null,0,"",null,0,""]
[null,"TAT",null,{"$f":"'2. P&L'!F69","v":0},{"$f":"'2. P&L'!G69","v":0},null,0,"",null,0,"",null,{"$f":"IF(ABS(E65/$E$72)>'1. Info'!$D$24,\"SIGNIFICATIF\",\"NON MATERIEL\")","v":{"$error":"#DIV/0!"}}]
[null,"Charge TAT brute comptabilisée",null,{"$f":"'2. P&L'!F70","v":0},{"$f":"'2. P&L'!G70","v":0},null,0,"",null,0,"",null,{"$f":"IF(ABS(E66/$E$72)>'1. Info'!$D$24,\"SIGNIFICATIF\",\"NON MATERIEL\")","v":{"$error":"#DIV/0!"}}]
[null,"Remboursement reçu de l'état au titre de la TAT",null,{"$f":"'2. P&L'!F71","v":0},{"$f":"'2. P&L'!G71","v":0},null,0,"",null,0,"",null,{"$f":"IF(ABS(E67/$E$72)>'1. Info'!$D$24,\"SIGNIFICATIF\",\"NON MATERIEL\")","v":{"$error":"#DIV/0!"}}]
[null,"CET",null,{"$f":"'2. P&L'!F72","v":0},{"$f":"'2. P&L'!G72","v":0},null,0,"",null,0,"",null,{"$f":"IF(ABS(E68/$E$72)>'1. Info'!$D$24,\"SIGNIFICATIF\",\"NON MATERIEL\")","v":{"$error":"#DIV/0!"}}]
[null,"CVE",null,{"$f":"'2. P&L'!F73","v":0},{"$f":"'2. P&L'!G73","v":0},null,0,"",null,0,"",null,{"$f":"IF(ABS(E69/$E$72)>'1. Info'!$D$24,\"SIGNIFICATIF\",\"NON MATERIEL\")","v":{"$error":"#DIV/0!"}}]
[null,"Autres impôts et taxes",null,{"$f":"'2. P&L'!F74","v":0},{"$f":"'2. P&L'!G74","v":0},null,0,"",null,0,"",null,{"$f":"IF(ABS(E70/$E$72)>'1. Info'!$D$24,\"SIGNIFICATIF\",\"NON MATERIEL\")","v":{"$error":"#DIV/0!"}}]
[null,"Autres Charges d'exploitation",null,{"$f":"'2. P&L'!F75","v":0},{"$f":"'2. P&L'!G75","v":0},null,0,"",null,0,"",null,{"$f":"IF(ABS(E71/$E$72)>'1. Info'!$D$24,\"SIGNIFICATIF\",\"NON MATERIEL\")","v":{"$error":"#DIV/0!"}}]
[null,"EBITDA",null,{"$f":"'2. P&L'!F76","v":0},{"$f":"E30++E40+E46+E58+E64+E71","v":0},null,0,"",null,0,""]
[null,"marge Ebitda",null,{"$f":"'2. P&L'!F77","v":""},{"$f":"IFERROR(E72/E30,\"\")","v":""},null,null,"",null,null,""]
[null,"Dotations aux amortissements",null,{"$f":"'2. P&L'!F78","v":0},{"$f":"'2. P&L'!G78","v":0},null,{"$f":"D74-C74","v":0},"",null,{"$f":"E74-D74","v":0},"",null,{"$f":"IF(ABS(E74/$E$72)>'1. Info'!$D$24,\"SIGNIFICATIF\",\"NON MATERIEL\")","v":{"$error":"#DIV/0!"}}]
[null,"Dotations aux amortissements des immobilisations non renouvelables",null,{"$f":"'2. P&L'!F79","v":0},{"$f":"'2. P&L'!G79","v":0},null,0,"",null,0,"",null,{"$f":"IF(ABS(E75/$E$72)>'1. Info'!$D$24,\"SIGNIFICATIF\",\"NON MATERIEL\")","v":{"$error":"#DIV/0!"}}]
[null,"Dotations aux amortissements des immobilisations renouvelables",null,{"$f":"'2. P&L'!F80","v":0},{"$f":"'2. P&L'!G80","v":0},null,0,"",null,0,"",null,{"$f":"IF(ABS(E76/$E$72)>'1. Info'!$D$24,\"SIGNIFICATIF\",\"NON MATERIEL\")","v":{"$error":"#DIV/0!"}}]
[null,"Autres dotations aux amort. et prov. (net reprises)",null,{"$f":"'2. P&L'!F81","v":0},{"$f":"'2. P&L'!G81","v":0},null,0,"",null,0,"",null,{"$f":"IF(ABS(E77/$E$72)>'1. Info'!$D$24,\"SIGNIFICATIF\",\"NON MATERIEL\")","v":{"$error":"#DIV/0!"}}]
[null,"dont provision / reprise pour renouvellement des couches de chaussées",null,null,{"$f":"'2. P&L'!G82","v":0},null,0,"",null,0,"",null,{"$f":"IF(ABS(E78/$E$72)>'1. Info'!$D$24,\"SIGNIFICATIF\",\"NON MATERIEL\")","v":{"$error":"#DIV/0!"}}]
[null,"dont provision / reprise pour maintien en état des ouvrages d'art",null,null,{"$f":"'2. P&L'!G83","v":0},null,0,"",null,0,"",null,{"$f":"IF(ABS(E79/$E$72)>'1. Info'!$D$24,\"SIGNIFICATIF\",\"NON MATERIEL\")","v":{"$error":"#DIV/0!"}}]
[null,"dont provision / reprise exceptionnelle liée à la masse salariale",null,null,{"$f":"'2. P&L'!G84","v":0},null,0,"",null,0,"",null,{"$f":"IF(ABS(E80/$E$72)>'1. Info'!$D$24,\"SIGNIFICATIF\",\"NON MATERIEL\")","v":{"$error":"#DIV/0!"}}]
[null,"dont autres provisions / reprises d'exploitation",null,null,{"$f":"'2. P&L'!G85","v":0},null,0,"",null,0,"",null,{"$f":"IF(ABS(E81/$E$72)>'1. Info'!$D$24,\"SIGNIFICATIF\",\"NON MATERIEL\")","v":{"$error":"#DIV/0!"}}]
[null,"Reprises des Subventions d'investissements",null,{"$f":"'2. P&L'!F86","v":0},{"$f":"'2. P&L'!G86","v":0},null,0,"",null,0,"",null,{"$f":"IF(ABS(E82/$E$72)>'1. Info'!$D$24,\"SIGNIFICATIF\",\"NON MATERIEL\")","v":{"$error":"#DIV/0!"}}]
[null,"EBIT",null,{"$f":"'2. P&L'!F87","v":0},{"$f":"+E72+E74+E77+E82","v":0},null,0,"",null,0,""]
[null,null,null,null,null,null,null,""]
[null,"PRODUITS FINANCIERS",null,{"$f":"'2. P&L'!F89","v":0},{"$f":"SUM(E86:E90)","v":0},null,{"$f":"D85-C85","v":0},"",null,{"$f":"E85-D85","v":0},{"$f":"IFERROR(E85/D85-1,\"\")","v":""}]
[null,"Dividendes reçus",null,{"$f":"'2. P&L'!F90","v":0},{"$f":"'2. P&L'!G90","v":0},null,0,"",null,0,"",null,{"$f":"IF(ABS(E86/$E$72)>'1. Info'!$D$24,\"SIGNIFICATIF\",\"NON MATERIEL\")","v":{"$error":"#DIV/0!"}}]
[null,"dont provenant de SCA françaises",null,{"$f":"'2. P&L'!F91","v":0},{"$f":"'2. P&L'!G91","v":0},null,0,"",null,0,"",null,{"$f":"IF(ABS(E87/$E$72)>'1. Info'!$D$24,\"SIGNIFICATIF\",\"NON MATERIEL\")","v":{"$error":"#DIV/0!"}}]
[null,"dont provenant d'autres filiales françaises ou étrangères",null,{"$f":"'2. P&L'!F92","v":0},{"$f":"'2. P&L'!G92","v":0},null,0,"",null,0,"",null,{"$f":"IF(ABS(E88/$E$72)>'1. Info'!$D$24,\"SIGNIFICATIF\",\"NON MATERIEL\")","v":{"$error":"#DIV/0!"}}]
[null,"Intérêts sur créances",null,{"$f":"'2. P&L'!F93","v":0},{"$f":"'2. P&L'!G93","v":0},null,0,"",null,0,"",null,{"$f":"IF(ABS(E89/$E$72)>'1. Info'!$D$24,\"SIGNIFICATIF\",\"NON MATERIEL\")","v":{"$error":"#DIV/0!"}}]
[null,"Autres produits financiers",null,{"$f":"'2. P&L'!F94","v":0},{"$f":"'2. P&L'!G94","v":0},null,0,"",null,0,"",null,{"$f":"IF(ABS(E90/$E$72)>'1. Info'!$D$24,\"SIGNIFICATIF\",\"NON MATERIEL\")","v":{"$error":"#DIV/0!"}}]
[null,"CHARGES FINANCIERES",null,{"$f":"'2. P&L'!F95","v":0},{"$f":"+E92+E94","v":0},null,0,{"$f":"IFERROR(D91/C91-1,\"\")","v":""},null,0,""]
[null,"Charges financières sur emprunts",null,{"$f":"'2. P&L'!F96","v":0},{"$f":"'2. P&L'!G96","v":0},null,0,"",null,0,"",null,{"$f":"IF(ABS(E92/$E$72)>'1. Info'!$D$24,\"SIGNIFICATIF\",\"NON MATERIEL\")","v":{"$error":"#DIV/0!"}}]
[null,"dont prime (soulte) sur opération de refinancement",null,{"$f":"'2. P&L'!F97","v":0},{"$f":"'2. P&L'!G97","v":0},null,0,"",null,0,"",null,{"$f":"IF(ABS(E93/$E$72)>'1. Info'!$D$24,\"SIGNIFICATIF\",\"NON MATERIEL\")","v":{"$error":"#DIV/0!"}}]
[null,"Autres charges financières",null,{"$f":"'2. P&L'!F98","v":0},{"$f":"'2. P&L'!G98","v":0},null,0,"",null,0,"",null,{"$f":"IF(ABS(E94/$E$72)>'1. Info'!$D$24,\"SIGNIFICATIF\",\"NON MATERIEL\")","v":{"$error":"#DIV/0!"}}]
[null,"RESULTAT FINANCIER",null,{"$f":"'2. P&L'!F99","v":0},{"$f":"E85+E91","v":0},null,0,"",null,0,""]
[null,"Taux intérêt implicite",null,{"$f":"'2. P&L'!F100","v":""},{"$f":"'2. P&L'!G100","v":0},null,null,"",null,null,""]
[null,null,null,null,null,null,null,""]
[null,"RESULTAT COURANT",null,{"$f":"'2. P&L'!F102","v":0},{"$f":"+E83+E95","v":0},null,{"$f":"D98-C98","v":0},"",null,{"$f":"E98-D98","v":0},{"$f":"IFERROR(E98/D98-1,\"\")","v":""}]
[null,null,null,null,null,null,null,""]
[null,"RESULTAT EXCEPTIONNEL",null,{"$f":"'2. P&L'!F104","v":0},null,null,{"$f":"D100-C100","v":0},"",null,{"$f":"E100-D100","v":0},""]
[null,null,null,null,null,null,null,""]
[null,"RESULTAT AVANT IMPOTS",null,{"$f":"'2. P&L'!F106","v":0},{"$f":"+E98+E100","v":0},null,{"$f":"D102-C102","v":0},"",null,{"$f":"E102-D102","v":0},""]
[null,"Impôt sur les sociétés",null,{"$f":"'2. P&L'!F107","v":0},{"$f":"'2. P&L'!G107","v":0},null,0,"",null,{"$f":"E103-D103","v":0},"",null,{"$f":"IF(ABS(E103/$E$72)>'1. Info'!$D$24,\"SIGNIFICATIF\",\"NON MATERIEL\")","v":{"$error":"#DIV/0!"}}]
[null,"RESULTAT NET",null,{"$f":"'2. P&L'!F108","v":0},{"$f":"E102+E103","v":0},null,0,"",null,{"$f":"E104-D104","v":0},""]
[null,"marge nette",{"$f":"'2. P&L'!G109","v":""},{"$f":"'2. P&L'!F109","v":""},{"$f":"IFERROR(E104/E30,\"\")","v":""},null,null,"",null,null,""]
[null,null,null,null,null,null,null,""]
[null,"Taux IS",null,{"$f":"'2. P&L'!F111","v":0},{"$f":"'2. P&L'!G111","v":0},null,null,"",null,null,{"$f":"IFERROR(E107/D107-1,\"\")","v":""}]
[]
[null,"CASH FLOW "]
[]
[null,"( en M€ courants )  ","2015 (p) n-2","2015 (p) n-1","2015 (r)",null,"Ecart en M€","Ecart en %",null,"Ecart en M€","Ecart en %",null,"Matérialité des données"]
[null,"EBIT",null,{"$f":"'3. CF'!F5","v":0},{"$f":"'2. P&L'!G87","v":0},null,{"$f":"D112-C112","v":0},{"$f":"IFERROR(D112/C112-1,\"\")","v":""},null,{"$f":"E112-D112","v":0},{"$f":"IFERROR(E112/D112-1,\"\")","v":""},null,{"$f":"IF(ABS(E112/$E$72)>'1. Info'!$D$25,\"SIGNIFICATIF\",\"NON MATERIEL\")","v":{"$error":"#DIV/0!"}}]
[null,"Amortissements nets de subventions et provisions",null,{"$f":"'3. CF'!F6","v":0},{"$f":"'3. CF'!G6","v":0},null,0,"",null,0,"",null,{"$f":"IF(ABS(E113/$E$72)>'1. Info'!$D$25,\"SIGNIFICATIF\",\"NON MATERIEL\")","v":{"$error":"#DIV/0!"}}]
[null,"Plus-value / moins-value de cession",null,{"$f":"'3. CF'!F7","v":0},{"$f":"'3. CF'!G7","v":0},null,0,"",null,0,"",null,{"$f":"IF(ABS(E114/$E$72)>'1. Info'!$D$25,\"SIGNIFICATIF\",\"NON MATERIEL\")","v":{"$error":"#DIV/0!"}}]
[null,"Intérêts financiers nets payés",null,{"$f":"'3. CF'!F8","v":0},{"$f":"'3. CF'!G8","v":0},null,0,"",null,0,"",null,{"$f":"IF(ABS(E115/$E$72)>'1. Info'!$D$25,\"SIGNIFICATIF\",\"NON MATERIEL\")","v":{"$error":"#DIV/0!"}}]
[null,"Impôts payés",null,{"$f":"'3. CF'!F9","v":0},{"$f":"'3. CF'!G9","v":0},null,0,"",null,0,"",null,{"$f":"IF(ABS(E116/$E$72)>'1. Info'!$D$25,\"SIGNIFICATIF\",\"NON MATERIEL\")","v":{"$error":"#DIV/0!"}}]
[null,"Revenus des titres de participation",null,{"$f":"'3. CF'!F10","v":0},{"$f":"'3. CF'!G10","v":0},null,0,"",null,0,"",null,{"$f":"IF(ABS(E117/$E$72)>'1. Info'!$D$25,\"SIGNIFICATIF\",\"NON MATERIEL\")","v":{"$error":"#DIV/0!"}}]
[null,"Variation du BFR",null,{"$f":"'3. CF'!F11","v":0},{"$f":"'3. CF'!G11","v":0},null,0,"",null,0,"",null,{"$f":"IF(ABS(E118/$E$72)>'1. Info'!$D$25,\"SIGNIFICATIF\",\"NON MATERIEL\")","v":{"$error":"#DIV/0!"}}]
[null,"CASH FLOW OPERATIONNELS /FFO",null,{"$f":"'3. CF'!F12","v":0},{"$f":"+SUM(E112:E118)","v":0},null,0,"",null,0,""]
[null,"Acquisitions d’immobilisations",null,{"$f":"'3. CF'!F13","v":0},{"$f":"'3. CF'!G13","v":0},null,0,"",null,0,"",null,{"$f":"IF(ABS(E120/$E$72)>'1. Info'!$D$25,\"SIGNIFICATIF\",\"NON MATERIEL\")","v":{"$error":"#DIV/0!"}}]
[null,"- Immobilisations non renouvelables ou ICAS",null,{"$f":"'3. CF'!F14","v":0},{"$f":"'3. CF'!G14","v":0},null,0,"",null,0,"",null,{"$f":"IF(ABS(E121/$E$72)>'1. Info'!$D$25,\"SIGNIFICATIF\",\"NON MATERIEL\")","v":{"$error":"#DIV/0!"}}]
[null,"- Immobilisations  renouvelables ou IEAS",null,{"$f":"'3. CF'!F15","v":0},{"$f":"'3. CF'!G15","v":0},null,0,"",null,0,"",null,{"$f":"IF(ABS(E122/$E$72)>'1. Info'!$D$25,\"SIGNIFICATIF\",\"NON MATERIEL\")","v":{"$error":"#DIV/0!"}}]
[null,"Cessions d’immobilisations",null,{"$f":"'3. CF'!F16","v":0},{"$f":"'3. CF'!G16","v":0},null,0,"",null,0,"",null,{"$f":"IF(ABS(E123/$E$72)>'1. Info'!$D$25,\"SIGNIFICATIF\",\"NON MATERIEL\")","v":{"$error":"#DIV/0!"}}]
[null,"Acquisition  / cession d'Immobilisations financières",null,{"$f":"'3. CF'!F17","v":0},{"$f":"'3. CF'!G17","v":0},null,0,"",null,0,"",null,{"$f":"IF(ABS(E124/$E$72)>'1. Info'!$D$25,\"SIGNIFICATIF\",\"NON MATERIEL\")","v":{"$error":"#DIV/0!"}}]
[null,"FLUX NETS DE TRESORERIE LIES AUX\nOPERATIONS D'INVESTISSEMENTS",null,{"$f":"'3. CF'!F18","v":0},{"$f":"'3. CF'!G18","v":0},null,0,"",null,0,""]
[null,"Dividendes versés",null,{"$f":"'3. CF'!F19","v":0},{"$f":"'3. CF'!G19","v":0},null,0,"",null,0,"",null,{"$f":"IF(ABS(E126/$E$72)>'1. Info'!$D$25,\"SIGNIFICATIF\",\"NON MATERIEL\")","v":{"$error":"#DIV/0!"}}]
[null,"dont dividende au titre du résultat de l'exercice N-1",null,{"$f":"'3. CF'!F20","v":0},{"$f":"'3. CF'!G20","v":0},null,0,"",null,0,"",null,{"$f":"IF(ABS(E127/$E$72)>'1. Info'!$D$25,\"SIGNIFICATIF\",\"NON MATERIEL\")","v":{"$error":"#DIV/0!"}}]
[null,"dont acompte sur dividende",null,{"$f":"'3. CF'!F21","v":0},{"$f":"'3. CF'!G21","v":0},null,0,"",null,0,"",null,{"$f":"IF(ABS(E128/$E$72)>'1. Info'!$D$25,\"SIGNIFICATIF\",\"NON MATERIEL\")","v":{"$error":"#DIV/0!"}}]
[null,"Subventions d'investissement reçues",null,{"$f":"'3. CF'!F22","v":0},{"$f":"'3. CF'!G22","v":0},null,0,"",null,0,"",null,{"$f":"IF(ABS(E129/$E$72)>'1. Info'!$D$25,\"SIGNIFICATIF\",\"NON MATERIEL\")","v":{"$error":"#DIV/0!"}}]
[null,"Emission Nouveaux Emprunts",null,{"$f":"'3. CF'!F23","v":0},{"$f":"'3. CF'!G23","v":0},null,0,"",null,0,"",null,{"$f":"IF(ABS(E130/$E$72)>'1. Info'!$D$25,\"SIGNIFICATIF\",\"NON MATERIEL\")","v":{"$error":"#DIV/0!"}}]
[null,"Remboursement emprunts",null,{"$f":"'3. CF'!F24","v":0},{"$f":"'3. CF'!G24","v":0},null,0,"",null,0,"",null,{"$f":"IF(ABS(E131/$E$72)>'1. Info'!$D$25,\"SIGNIFICATIF\",\"NON MATERIEL\")","v":{"$error":"#DIV/0!"}}]
[null,"Prime  sur opération de refinancement",null,{"$f":"'3. CF'!F25","v":0},{"$f":"'3. CF'!G25","v":0},null,0,"",null,0,"",null,{"$f":"IF(ABS(E132/$E$72)>'1. Info'!$D$25,\"SIGNIFICATIF\",\"NON MATERIEL\")","v":{"$error":"#DIV/0!"}}]
[null,"Opérations en capital",null,{"$f":"'3. CF'!F26","v":0},{"$f":"'3. CF'!G26","v":0},null,0,"",null,0,"",null,{"$f":"IF(ABS(E133/$E$72)>'1. Info'!$D$25,\"SIGNIFICATIF\",\"NON MATERIEL\")","v":{"$error":"#DIV/0!"}}]
[null,"Opérations sur comptes de réserve",null,{"$f":"'3. CF'!F27","v":0},{"$f":"'3. CF'!G27","v":0},null,0,"",null,0,"",null,{"$f":"IF(ABS(E134/$E$72)>'1. Info'!$D$25,\"SIGNIFICATIF\",\"NON MATERIEL\")","v":{"$error":"#DIV/0!"}}]
[null,"FLUX NETS DE TRESORERIE LIES AUX\nOPERATIONS DE FINANCEMENT",null,{"$f":"'3. CF'!F28","v":0},{"$f":"+E126+E129+E130+E131+E132+E133+E134","v":0},null,{"$f":"D135-C135","v":0},"",null,0,""]
[null,null,null,{"$f":"'3. CF'!F29","v":0},null,null,null,"",null,null,""]
[null,"VARIATION DE TRESORERIE",null,{"$f":"'3. CF'!F30","v":0},{"$f":"E135+E125+E119","v":0},null,{"$f":"D137-C137","v":0},"",null,{"$f":"E137-D137","v":0},""]
[null,null,null,null,null,null,null,"",null,null,""]
[null,"TRESORERIE D'OUVERTURE",null,{"$f":"'3. CF'!F32","v":0},{"$f":"'3. CF'!G32","v":0},null,{"$f":"D139-C139","v":0},"",null,{"$f":"E139-D139","v":0},""]
[null,"TRESORERIE DE CLOTURE",null,{"$f":"'3. CF'!F33","v":0},{"$f":"E139+E137","v":0},null,{"$f":"D140-C140","v":0},"",null,0,""]
[]
[null,"Bilan"]
[]
[null,"( en M€ courants)  ","2015 (p) n-2","2015 (p) n-1","2015 (r)",null,"Ecart en M€","Ecart en %",null,"Ecart en M€","Ecart en %",null,"Matérialité des données"]
[null,"ACTIF",null,{"$f":"'4. Bilan & ratios'!F5","v":0},{"$f":"E147+E156","v":0},null,{"$f":"D145-C145","v":0},{"$f":"IFERROR(D145/C145-1,\"\")","v":""},null,{"$f":"E145-D145","v":0},{"$f":"IFERROR(E145/D145-1,\"\")","v":""}]
[null,null,null,null,null,null,null,""]
[null,"Actif immobilisé",null,{"$f":"'4. Bilan & ratios'!F7","v":0},{"$f":"E148+E149+E150","v":0},null,{"$f":"D147-C147","v":0},"",null,{"$f":"E147-D147","v":0},{"$f":"IFERROR(E147/D147-1,\"\")","v":""}]
[null,"Immobilisations incorporelles (nettes)",null,{"$f":"'4. Bilan & ratios'!F8","v":0},{"$f":"'4. Bilan & ratios'!G8","v":0},null,0,"",null,0,"",null,{"$f":"IF(ABS(E148/$E$145)>'1. Info'!$D$26,\"SIGNIFICATIF\",\"NON MATERIEL\")","v":{"$error":"#DIV/0!"}}]
[null,"Immobilisations corporelles  du domaine concédé (nettes)",null,{"$f":"'4. Bilan & ratios'!F9","v":0},{"$f":"'4. Bilan & ratios'!G9","v":0},null,0,"",null,0,"",null,{"$f":"IF(ABS(E149/$E$145)>'1. Info'!$D$26,\"SIGNIFICATIF\",\"NON MATERIEL\")","v":{"$error":"#DIV/0!"}}]
[null,"Immobilisations financières (nettes)",null,{"$f":"'4. Bilan & ratios'!F10","v":0},{"$f":"'4. Bilan & ratios'!G10","v":0},null,0,"",null,0,"",null,{"$f":"IF(ABS(E150/$E$145)>'1. Info'!$D$26,\"SIGNIFICATIF\",\"NON MATERIEL\")","v":{"$error":"#DIV/0!"}}]
[null,"dont titres de participations dans sociétés consolidées",null,null,{"$f":"'4. Bilan & ratios'!G11","v":0},null,0,"",null,0,"",null,{"$f":"IF(ABS(E151/$E$145)>'1. Info'!$D$26,\"SIGNIFICATIF\",\"NON MATERIEL\")","v":{"$error":"#DIV/0!"}}]
[null,"dont titres de participations dans sociétés mises en équivalences",null,null,{"$f":"'4. Bilan & ratios'!G12","v":0},null,0,"",null,0,"",null,{"$f":"IF(ABS(E152/$E$145)>'1. Info'!$D$26,\"SIGNIFICATIF\",\"NON MATERIEL\")","v":{"$error":"#DIV/0!"}}]
[null,"dont créances rattachées à des participations",null,null,{"$f":"'4. Bilan & ratios'!G13","v":0},null,0,"",null,0,"",null,{"$f":"IF(ABS(E153/$E$145)>'1. Info'!$D$26,\"SIGNIFICATIF\",\"NON MATERIEL\")","v":{"$error":"#DIV/0!"}}]
[null,"dont prêts",null,null,{"$f":"'4. Bilan & ratios'!G14","v":0},null,0,"",null,0,"",null,{"$f":"IF(ABS(E154/$E$145)>'1. Info'!$D$26,\"SIGNIFICATIF\",\"NON MATERIEL\")","v":{"$error":"#DIV/0!"}}]
[null,"dont autre",null,null,{"$f":"'4. Bilan & ratios'!G15","v":0},null,0,"",null,0,"",null,{"$f":"IF(ABS(E155/$E$145)>'1. Info'!$D$26,\"SIGNIFICATIF\",\"NON MATERIEL\")","v":{"$error":"#DIV/0!"}}]
[null,"Actif circulant",null,{"$f":"'4. Bilan & ratios'!F16","v":0},{"$f":"SUM(E157:E161)","v":0},null,0,"",null,0,""]
[null,"Stocks",null,null,{"$f":"'4. Bilan & ratios'!G17","v":0},null,0,"",null,0,"",null,{"$f":"IF(ABS(E157/$E$145)>'1. Info'!$D$26,\"SIGNIFICATIF\",\"NON MATERIEL\")","v":{"$error":"#DIV/0!"}}]
[null,"Créances clients ",null,null,{"$f":"'4. Bilan & ratios'!G18","v":0},null,0,"",null,0,"",null,{"$f":"IF(ABS(E158/$E$145)>'1. Info'!$D$26,\"SIGNIFICATIF\",\"NON MATERIEL\")","v":{"$error":"#DIV/0!"}}]
[null,"Créances sociales et fiscales",null,null,{"$f":"'4. Bilan & ratios'!G19","v":0},null,0,"",null,0,"",null,{"$f":"IF(ABS(E159/$E$145)>'1. Info'!$D$26,\"SIGNIFICATIF\",\"NON MATERIEL\")","v":{"$error":"#DIV/0!"}}]
[null,"Autres créances et comptes de régularisation",null,{"$f":"'4. Bilan & ratios'!F20","v":0},{"$f":"'4. Bilan & ratios'!G20","v":0},null,0,"",null,0,"",null,{"$f":"IF(ABS(E160/$E$145)>'1. Info'!$D$26,\"SIGNIFICATIF\",\"NON MATERIEL\")","v":{"$error":"#DIV/0!"}}]
[null,"Trésorerie",null,{"$f":"'4. Bilan & ratios'!F21","v":0},{"$f":"'4. Bilan & ratios'!G21","v":0},null,0,"",null,0,"",null,{"$f":"IF(ABS(E161/$E$145)>'1. Info'!$D$26,\"SIGNIFICATIF\",\"NON MATERIEL\")","v":{"$error":"#DIV/0!"}}]
[null,"dont comptes de réserve",null,null,{"$f":"'4. Bilan & ratios'!G22","v":0},null,null,"",null,null,"",null,{"$f":"IF(ABS(E162/$E$145)>'1. Info'!$D$26,\"SIGNIFICATIF\",\"NON MATERIEL\")","v":{"$error":"#DIV/0!"}}]
[null,null,null,null,null,null,null,""]
[null,"PASSIF",null,{"$f":"'4. Bilan & ratios'!F25","v":0},{"$f":"+E166+E173+E174+E179+E188","v":0},null,{"$f":"D164-C164","v":0},"",null,{"$f":"E164-D164","v":0},{"$f":"IFERROR(E164/D164-1,\"\")","v":""}]
[null,null,null,{"$f":"'4. Bilan & ratios'!F26","v":0},null,null,null,""]
[null,"Capitaux propres",null,{"$f":"'4. Bilan & ratios'!F27","v":0},{"$f":"SUM(E167:E172)","v":0},null,{"$f":"D166-C166","v":0},"",null,{"$f":"E166-D166","v":0},{"$f":"IFERROR(E166/D166-1,\"\")","v":""}]
[null,"Capital social",null,{"$f":"'4. Bilan & ratios'!F28","v":0},{"$f":"'4. Bilan & ratios'!G28","v":0},null,0,"",null,0,"",null,{"$f":"IF(ABS(E167/$E$145)>'1. Info'!$D$26,\"SIGNIFICATIF\",\"NON MATERIEL\")","v":{"$error":"#DIV/0!"}}]
[null,"Primes et réserves",null,{"$f":"'4. Bilan & ratios'!F29","v":0},{"$f":"'4. Bilan & ratios'!G29","v":0},null,0,"",null,0,"",null,{"$f":"IF(ABS(E168/$E$145)>'1. Info'!$D$26,\"SIGNIFICATIF\",\"NON MATERIEL\")","v":{"$error":"#DIV/0!"}}]
[null,"Report à nouveau",null,{"$f":"'4. Bilan & ratios'!F30","v":0},{"$f":"'4. Bilan & ratios'!G30","v":0},null,0,"",null,0,"",null,{"$f":"IF(ABS(E169/$E$145)>'1. Info'!$D$26,\"SIGNIFICATIF\",\"NON MATERIEL\")","v":{"$error":"#DIV/0!"}}]
[null,"Résultat de l'exercice",null,{"$f":"'4. Bilan & ratios'!F31","v":0},{"$f":"'4. Bilan & ratios'!G31","v":0},null,0,"",null,0,"",null,{"$f":"IF(ABS(E170/$E$145)>'1. Info'!$D$26,\"SIGNIFICATIF\",\"NON MATERIEL\")","v":{"$error":"#DIV/0!"}}]
[null,"Subventions d'investissement",null,{"$f":"'4. Bilan & ratios'!F32","v":0},{"$f":"'4. Bilan & ratios'!G32","v":0},null,0,"",null,0,"",null,{"$f":"IF(ABS(E171/$E$145)>'1. Info'!$D$26,\"SIGNIFICATIF\",\"NON MATERIEL\")","v":{"$error":"#DIV/0!"}}]
[null,"Provisions réglementées",null,{"$f":"'4. Bilan & ratios'!F33","v":0},{"$f":"'4. Bilan & ratios'!G33","v":0},null,0,"",null,0,"",null,{"$f":"IF(ABS(E172/$E$145)>'1. Info'!$D$26,\"SIGNIFICATIF\",\"NON MATERIEL\")","v":{"$error":"#DIV/0!"}}]
[null,"Autres Fonds Propres",null,{"$f":"'4. Bilan & ratios'!F34","v":0},{"$f":"'4. Bilan & ratios'!G34","v":0},null,0,"",null,0,"",null,{"$f":"IF(ABS(E173/$E$145)>'1. Info'!$D$26,\"SIGNIFICATIF\",\"NON MATERIEL\")","v":{"$error":"#DIV/0!"}}]
[null,"Provisions pour risques et charges",null,{"$f":"'4. Bilan & ratios'!F35","v":0},{"$f":"SUM(E175:E178)","v":0},null,0,"",null,0,""]
[null,"dont provisions pour indemnités de fin de carrière",null,null,{"$f":"'4. Bilan & ratios'!G36","v":0},null,0,"",null,0,"",null,{"$f":"IF(ABS(E175/$E$145)>'1. Info'!$D$26,\"SIGNIFICATIF\",\"NON MATERIEL\")","v":{"$error":"#DIV/0!"}}]
[null,"dont provisions pour gros entretien",null,null,{"$f":"'4. Bilan & ratios'!G37","v":0},null,0,"",null,0,"",null,{"$f":"IF(ABS(E176/$E$145)>'1. Info'!$D$26,\"SIGNIFICATIF\",\"NON MATERIEL\")","v":{"$error":"#DIV/0!"}}]
[null,"dont provisions pour indexation d'emprunts",null,null,{"$f":"'4. Bilan & ratios'!G38","v":0},null,0,"",null,0,"",null,{"$f":"IF(ABS(E177/$E$145)>'1. Info'!$D$26,\"SIGNIFICATIF\",\"NON MATERIEL\")","v":{"$error":"#DIV/0!"}}]
[null,"dont autres provisions pour risques et charges",null,null,{"$f":"'4. Bilan & ratios'!G39","v":0},null,0,"",null,0,"",null,{"$f":"IF(ABS(E178/$E$145)>'1. Info'!$D$26,\"SIGNIFICATIF\",\"NON MATERIEL\")","v":{"$error":"#DIV/0!"}}]
[null,"Emprunts et dettes financières",null,{"$f":"'4. Bilan & ratios'!F40","v":0},{"$f":"SUM(E180:E187)","v":0},null,0,"",null,0,""]
[null,"dont emprunts ",null,null,{"$f":"'4. Bilan & ratios'!G41","v":0},null,0,"",null,0,"",null,{"$f":"IF(ABS(E180/$E$145)>'1. Info'!$D$26,\"SIGNIFICATIF\",\"NON MATERIEL\")","v":{"$error":"#DIV/0!"}}]
[null,"dont ligne de crédit externe",null,null,{"$f":"'4. Bilan & ratios'!G42","v":0},null,0,"",null,0,"",null,{"$f":"IF(ABS(E181/$E$145)>'1. Info'!$D$26,\"SIGNIFICATIF\",\"NON MATERIEL\")","v":{"$error":"#DIV/0!"}}]
[null,"dont ligne de crédit intragroupe",null,null,{"$f":"'4. Bilan & ratios'!G43","v":0},null,null,"",null,null,"",null,{"$f":"IF(ABS(E182/$E$145)>'1. Info'!$D$26,\"SIGNIFICATIF\",\"NON MATERIEL\")","v":{"$error":"#DIV/0!"}}]
[null,"dont dettes de trésorerie",null,null,{"$f":"'4. Bilan & ratios'!G44","v":0},null,{"$f":"D183-C183","v":0},"",null,0,"",null,{"$f":"IF(ABS(E183/$E$145)>'1. Info'!$D$26,\"SIGNIFICATIF\",\"NON MATERIEL\")","v":{"$error":"#DIV/0!"}}]
[null,"dont prêt intragroupe / C/C associés",null,null,{"$f":"'4. Bilan & ratios'!G45","v":0},null,0,"",null,0,"",null,{"$f":"IF(ABS(E184/$E$145)>'1. Info'!$D$26,\"SIGNIFICATIF\",\"NON MATERIEL\")","v":{"$error":"#DIV/0!"}}]
[null,"dont ICNE",null,null,{"$f":"'4. Bilan & ratios'!G46","v":0},null,0,"",null,0,"",null,{"$f":"IF(ABS(E185/$E$145)>'1. Info'!$D$26,\"SIGNIFICATIF\",\"NON MATERIEL\")","v":{"$error":"#DIV/0!"}}]
[null,"dont C/C de cash pooling",null,null,{"$f":"'4. Bilan & ratios'!G47","v":0},null,0,"",null,0,"",null,{"$f":"IF(ABS(E186/$E$145)>'1. Info'!$D$26,\"SIGNIFICATIF\",\"NON MATERIEL\")","v":{"$error":"#DIV/0!"}}]
[null,"dont autres",null,null,{"$f":"'4. Bilan & ratios'!G48","v":0},null,0,"",null,0,"",null,{"$f":"IF(ABS(E187/$E$145)>'1. Info'!$D$26,\"SIGNIFICATIF\",\"NON MATERIEL\")","v":{"$error":"#DIV/0!"}}]
[null,"Passif circulant",null,{"$f":"'4. Bilan & ratios'!F49","v":0},{"$f":"SUM(E189:E192)","v":0},null,0,"",null,0,""]
[null,"Dettes sur immobilisations",null,null,{"$f":"'4. Bilan & ratios'!G50","v":0},null,0,"",null,0,"",null,{"$f":"IF(ABS(E189/$E$145)>'1. Info'!$D$26,\"SIGNIFICATIF\",\"NON MATERIEL\")","v":{"$error":"#DIV/0!"}}]
[null,"Dettes fournisseurs",null,null,{"$f":"'4. Bilan & ratios'!G51","v":0},null,0,"",null,0,"",null,{"$f":"IF(ABS(E190/$E$145)>'1. Info'!$D$26,\"SIGNIFICATIF\",\"NON MATERIEL\")","v":{"$error":"#DIV/0!"}}]
[null,"Dettes fiscales et sociales",null,null,{"$f":"'4. Bilan & ratios'!G52","v":0},null,0,"",null,0,"",null,{"$f":"IF(ABS(E191/$E$145)>'1. Info'!$D$26,\"SIGNIFICATIF\",\"NON MATERIEL\")","v":{"$error":"#DIV/0!"}}]
[null,"Autres dettes",null,null,{"$f":"'4. Bilan & ratios'!G53","v":0},null,0,"",null,0,"",null,{"$f":"IF(ABS(E192/$E$145)>'1. Info'!$D$26,\"SIGNIFICATIF\",\"NON MATERIEL\")","v":{"$error":"#DIV/0!"}}]

{"sheet":"11. Bridge 2016 (ARAFER)","index":11,"n_rows":192,"n_cols":13,"rows_kept":192,"cut":false,"hidden":true,"merged":[[25,1,25,4],[108,1,108,4],[141,1,141,4]]}
[null,{"$f":"'1. Info'!$D$5","v":0}]
[]
[null,null,"2016 (p) n-2","2016 (p) n-1","2016 (r)",null,"Ecart 2016 (p) n-1/ 2016 (p) n-2 en M€","Ecart en %",null,"Ecart 2016 (r ) / 2016 (p) n-1 en M€","Ecart en %"]
[null,"Prix "]
[null,"Evolution Inflation utilisée dans la loi tarifaire en %",null,{"$f":"'2. P&L'!H7","v":0},{"$f":"'2. P&L'!I7","v":0},null,null,{"$f":"IFERROR(D5/C5-1,\"\")","v":""},null,null,{"$f":"IFERROR(E5/D5-1,\"\")","v":""}]
[null,"Evolution Inflation générale en %",null,{"$f":"'2. P&L'!H8","v":0},{"$f":"'2. P&L'!I8","v":0},null,null,{"$f":"IFERROR(D6/C6-1,\"\")","v":""},null,null,""]
[null,"Evolution TP01 en %",null,{"$f":"'2. P&L'!H9","v":0},{"$f":"'2. P&L'!I9","v":0},null,null,"",null,null,""]
[null,"Evolution TP09 en %",null,{"$f":"'2. P&L'!H10","v":0},{"$f":"'2. P&L'!I10","v":0},null,null,"",null,null,""]
[null,null,null,null,null,null,null,"",null,null,""]
[null,"Trafics",null,null,null,null,null,""]
[null,"Evolution Trafic  en % réseau payant",null,{"$f":"'2. P&L'!H13","v":0},{"$f":"'2. P&L'!I13","v":0},null,null,"",null,null,""]
[null,"Evolution Trafic VL en % réseau payant",null,{"$f":"'2. P&L'!H14","v":0},{"$f":"'2. P&L'!I14","v":0},null,null,"",null,null,""]
[null,"Evolution Trafic PL en % réseau payant",null,{"$f":"'2. P&L'!H15","v":0},{"$f":"'2. P&L'!I15","v":0},null,null,"",null,null,""]
[null,null,null,null,null,null,null,"",null,null,""]
[null,"Tarifs",null,null,null,null,null,""]
[null,"Evolution tarifs théorique Classe 1 en %",null,{"$f":"'2. P&L'!H18","v":0},{"$f":"'2. P&L'!I18","v":0},null,null,"",null,null,""]
[null,"Evolution tarifs théorique Classe 2 en %",null,{"$f":"'2. P&L'!H19","v":0},{"$f":"'2. P&L'!I19","v":0},null,null,"",null,null,""]
[null,"Evolution tarifs théorique Classe 3 en %",null,{"$f":"'2. P&L'!H20","v":0},{"$f":"'2. P&L'!I20","v":0},null,null,"",null,null,""]
[null,"Evolution tarifs théorique Classe 4 en %",null,{"$f":"'2. P&L'!H21","v":0},{"$f":"'2. P&L'!I21","v":0},null,null,"",null,null,""]
[null,"Evolution tarifs théorique Classe 5 en %",null,{"$f":"'2. P&L'!H22","v":0},{"$f":"'2. P&L'!I22","v":0},null,null,"",null,null,""]
[null,"Evolution tarifs réel en %",null,{"$f":"'2. P&L'!H24","v":0},{"$f":"'2. P&L'!I24","v":0},null,null,"",null,null,""]
[null,"Evolution tarifs réel VL en %",null,{"$f":"'2. P&L'!H25","v":0},{"$f":"'2. P&L'!I25","v":0},null,null,"",null,null,""]
[null,"Evolution tarifs réel PL en %",null,{"$f":"'2. P&L'!H26","v":0},{"$f":"'2. P&L'!I26","v":0},null,null,"",null,null,""]
[null,null,null,null,null,null,null,"",null,null,""]
[]
[null,"Compte de Résultat"]
[]
[null,"( en M€ courants )  ","2016 (p) n-2","2016 (p) n-1","2016 (r)",null,"Ecart en M€","Ecart en %",null,"Ecart en M€","Ecart en %",null,"Matérialité des données"]
[]
[null,"CHIFFRES D'AFFAIRES",null,{"$f":"'2. P&L'!H32","v":0},{"$f":"+E31+E36","v":0},null,{"$f":"D30-C30","v":0},{"$f":"IFERROR(D30/C30-1,\"\")","v":""},null,{"$f":"E30-D30","v":0},{"$f":"IFERROR(E30/D30-1,\"\")","v":""}]
[null,"Chiffre d'Affaires péage net",null,{"$f":"'2. P&L'!H33","v":0},{"$f":"'2. P&L'!I33","v":0},null,{"$f":"D31-C31","v":0},"",null,{"$f":"E31-D31","v":0},"",null,{"$f":"IF(ABS(E31/$E$72)>'1. Info'!$D$24,\"SIGNIFICATIF\",\"NON MATERIEL\")","v":{"$error":"#DIV/0!"}}]
[null,"% Evolution",null,{"$f":"'2. P&L'!H36","v":""},{"$f":"'2. P&L'!I36","v":""},null,null,"",null,null,""]
[null,"dont CA net VL",null,{"$f":"'2. P&L'!H37","v":""},{"$f":"'2. P&L'!I37","v":""},null,null,"",null,null,""]
[null,"dont CA net PL",null,{"$f":"'2. P&L'!H38","v":""},{"$f":"'2. P&L'!I38","v":""},null,null,"",null,null,""]
[null,null,null,null,null,null,null,""]
[null,"Revenus des activités annexes",null,{"$f":"'2. P&L'!H40","v":0},{"$f":"SUM(E37:E39)","v":0},null,{"$f":"D36-C36","v":0},"",null,{"$f":"E36-D36","v":0},{"$f":"IFERROR(E36/D36-1,\"\")","v":""},null,{"$f":"IF(ABS(E36/$E$72)>'1. Info'!$D$24,\"\",\"NON MATERIEL\")","v":{"$error":"#DIV/0!"}}]
[null," Redevances des installations commerciales",null,null,{"$f":"'2. P&L'!I41","v":0},null,0,"",null,0,"",null,{"$f":"IF(ABS(E37/$E$72)>'1. Info'!$D$24,\"SIGNIFICATIF\",\"NON MATERIEL\")","v":{"$error":"#DIV/0!"}}]
[null," Redevances des installations de télécommunication",null,null,{"$f":"'2. P&L'!I42","v":0},null,0,"",null,0,"",null,{"$f":"IF(ABS(E38/$E$72)>'1. Info'!$D$24,\"SIGNIFICATIF\",\"NON MATERIEL\")","v":{"$error":"#DIV/0!"}}]
[null," Autres éléments du chiffre d'affaires",null,null,{"$f":"'2. P&L'!I43","v":0},null,0,"",null,0,"",null,{"$f":"IF(ABS(E39/$E$72)>'1. Info'!$D$24,\"SIGNIFICATIF\",\"NON MATERIEL\")","v":{"$error":"#DIV/0!"}}]
[null,"AUTRES REVENUS D'EXPLOITATION",null,{"$f":"'2. P&L'!H44","v":0},{"$f":"SUM(E41:E44)","v":0},null,0,"",null,0,""]
[null,"Production Immobilisée",null,null,{"$f":"'2. P&L'!I45","v":0},null,0,"",null,0,"",null,{"$f":"IF(ABS(E41/$E$72)>'1. Info'!$D$24,\"SIGNIFICATIF\",\"NON MATERIEL\")","v":{"$error":"#DIV/0!"}}]
[null,"Remboursement accidents",null,null,{"$f":"'2. P&L'!I46","v":0},null,0,"",null,0,"",null,{"$f":"IF(ABS(E42/$E$72)>'1. Info'!$D$24,\"SIGNIFICATIF\",\"NON MATERIEL\")","v":{"$error":"#DIV/0!"}}]
[null,"Subventions d'exploitation",null,null,{"$f":"'2. P&L'!I47","v":0},null,0,"",null,0,"",null,{"$f":"IF(ABS(E43/$E$72)>'1. Info'!$D$24,\"SIGNIFICATIF\",\"NON MATERIEL\")","v":{"$error":"#DIV/0!"}}]
[null,"Autres produits d'exploitation",null,null,{"$f":"'2. P&L'!I48","v":0},null,0,"",null,0,"",null,{"$f":"IF(ABS(E44/$E$72)>'1. Info'!$D$24,\"SIGNIFICATIF\",\"NON MATERIEL\")","v":{"$error":"#DIV/0!"}}]
[null,"CHARGES D'EXPLOITATION",null,{"$f":"'2. P&L'!H49","v":0},{"$f":"E46+E58+E64+E71","v":0},null,0,"",null,0,""]
[null,"Achats et charges externes",null,{"$f":"'2. P&L'!H50","v":0},{"$f":"+E47+E48+E52+E53+E56","v":0},null,0,"",null,0,""]
[null,"Energie, achats stockés et consommables",null,{"$f":"'2. P&L'!H51","v":0},{"$f":"'2. P&L'!I51","v":0},null,0,"",null,0,"",null,{"$f":"IF(ABS(E47/$E$72)>'1. Info'!$D$24,\"SIGNIFICATIF\",\"NON MATERIEL\")","v":{"$error":"#DIV/0!"}}]
[null,"Gros entretien sur infrastructures",null,{"$f":"'2. P&L'!H52","v":0},{"$f":"'2. P&L'!I52","v":0},null,0,"",null,0,"",null,{"$f":"IF(ABS(E48/$E$72)>'1. Info'!$D$24,\"SIGNIFICATIF\",\"NON MATERIEL\")","v":{"$error":"#DIV/0!"}}]
[null,"dont gros entretien sur chaussées ",null,null,{"$f":"'2. P&L'!I53","v":0},null,0,"",null,0,"",null,{"$f":"IF(ABS(E49/$E$72)>'1. Info'!$D$24,\"SIGNIFICATIF\",\"NON MATERIEL\")","v":{"$error":"#DIV/0!"}}]
[null,"dont gros entretien sur ouvrages d'art",null,null,{"$f":"'2. P&L'!I54","v":0},null,0,"",null,0,"",null,{"$f":"IF(ABS(E50/$E$72)>'1. Info'!$D$24,\"SIGNIFICATIF\",\"NON MATERIEL\")","v":{"$error":"#DIV/0!"}}]
[null,"dont autre gros entretien",null,null,{"$f":"'2. P&L'!I55","v":0},null,0,"",null,0,"",null,{"$f":"IF(ABS(E51/$E$72)>'1. Info'!$D$24,\"SIGNIFICATIF\",\"NON MATERIEL\")","v":{"$error":"#DIV/0!"}}]
[null,"Entretien courant",null,{"$f":"'2. P&L'!H56","v":0},{"$f":"'2. P&L'!I56","v":0},null,0,"",null,0,"",null,{"$f":"IF(ABS(E52/$E$72)>'1. Info'!$D$24,\"SIGNIFICATIF\",\"NON MATERIEL\")","v":{"$error":"#DIV/0!"}}]
[null,"Redevance domaniale",null,{"$f":"'2. P&L'!H57","v":0},{"$f":"'2. P&L'!I57","v":0},null,0,"",null,0,"",null,{"$f":"IF(ABS(E53/$E$72)>'1. Info'!$D$24,\"SIGNIFICATIF\",\"NON MATERIEL\")","v":{"$error":"#DIV/0!"}}]
[null,"Charge redevance domaniale brute comptabilisée",null,{"$f":"'2. P&L'!H58","v":0},{"$f":"'2. P&L'!I58","v":0},null,0,"",null,0,"",null,{"$f":"IF(ABS(E54/$E$72)>'1. Info'!$D$24,\"SIGNIFICATIF\",\"NON MATERIEL\")","v":{"$error":"#DIV/0!"}}]
[null,"Remboursement reçu de l'état au titre de la redevance domaniale ",null,{"$f":"'2. P&L'!H59","v":0},{"$f":"'2. P&L'!I59","v":0},null,0,"",null,0,"",null,{"$f":"IF(ABS(E55/$E$72)>'1. Info'!$D$24,\"SIGNIFICATIF\",\"NON MATERIEL\")","v":{"$error":"#DIV/0!"}}]
[null,"Autres prestations et charges externes",null,{"$f":"'2. P&L'!H60","v":0},{"$f":"'2. P&L'!I60","v":0},null,0,"",null,0,"",null,{"$f":"IF(ABS(E56/$E$72)>'1. Info'!$D$24,\"SIGNIFICATIF\",\"NON MATERIEL\")","v":{"$error":"#DIV/0!"}}]
[null,"dont contrat d'exploitation",null,{"$f":"'2. P&L'!H61","v":0},{"$f":"'2. P&L'!I61","v":0},null,0,"",null,0,"",null,{"$f":"IF(ABS(E57/$E$72)>'1. Info'!$D$24,\"SIGNIFICATIF\",\"NON MATERIEL\")","v":{"$error":"#DIV/0!"}}]
[null,"Charges de personnel (yc participation et CICE)",null,{"$f":"'2. P&L'!H62","v":0},{"$f":"SUM(E59:E63)","v":0},null,0,"",null,0,""]
[null,"Salaires et traitements",null,null,{"$f":"'2. P&L'!I63","v":0},null,0,"",null,0,"",null,{"$f":"IF(ABS(E59/$E$72)>'1. Info'!$D$24,\"SIGNIFICATIF\",\"NON MATERIEL\")","v":{"$error":"#DIV/0!"}}]
[null,"Charges sociales et engagements sociaux différés",null,null,{"$f":"'2. P&L'!I64","v":0},null,0,"",null,0,"",null,{"$f":"IF(ABS(E60/$E$72)>'1. Info'!$D$24,\"SIGNIFICATIF\",\"NON MATERIEL\")","v":{"$error":"#DIV/0!"}}]
[null,"Intéressement, abondement du plan d'épargne et participation",null,null,{"$f":"'2. P&L'!I65","v":0},null,0,"",null,0,"",null,{"$f":"IF(ABS(E61/$E$72)>'1. Info'!$D$24,\"SIGNIFICATIF\",\"NON MATERIEL\")","v":{"$error":"#DIV/0!"}}]
[null,"CICE",null,null,{"$f":"'2. P&L'!I66","v":0},null,0,"",null,0,"",null,{"$f":"IF(ABS(E62/$E$72)>'1. Info'!$D$24,\"SIGNIFICATIF\",\"NON MATERIEL\")","v":{"$error":"#DIV/0!"}}]
[null,"Autres charges de personnel",null,null,{"$f":"'2. P&L'!I67","v":0},null,0,"",null,0,"",null,{"$f":"IF(ABS(E63/$E$72)>'1. Info'!$D$24,\"SIGNIFICATIF\",\"NON MATERIEL\")","v":{"$error":"#DIV/0!"}}]
[null,"Impôts et taxes",null,{"$f":"'2. P&L'!H68","v":0},{"$f":"+E65+E68+E69+E70","v":0},null,0,"",null,0,""]
[null,"TAT",null,{"$f":"'2. P&L'!H69","v":0},{"$f":"'2. P&L'!I69","v":0},null,0,"",null,0,"",null,{"$f":"IF(ABS(E65/$E$72)>'1. Info'!$D$24,\"SIGNIFICATIF\",\"NON MATERIEL\")","v":{"$error":"#DIV/0!"}}]
[null,"Charge TAT brute comptabilisée",null,{"$f":"'2. P&L'!H70","v":0},{"$f":"'2. P&L'!I70","v":0},null,0,"",null,0,"",null,{"$f":"IF(ABS(E66/$E$72)>'1. Info'!$D$24,\"SIGNIFICATIF\",\"NON MATERIEL\")","v":{"$error":"#DIV/0!"}}]
[null,"Remboursement reçu de l'état au titre de la TAT",null,{"$f":"'2. P&L'!H71","v":0},{"$f":"'2. P&L'!I71","v":0},null,0,"",null,0,"",null,{"$f":"IF(ABS(E67/$E$72)>'1. Info'!$D$24,\"SIGNIFICATIF\",\"NON MATERIEL\")","v":{"$error":"#DIV/0!"}}]
[null,"CET",null,{"$f":"'2. P&L'!H72","v":0},{"$f":"'2. P&L'!I72","v":0},null,0,"",null,0,"",null,{"$f":"IF(ABS(E68/$E$72)>'1. Info'!$D$24,\"SIGNIFICATIF\",\"NON MATERIEL\")","v":{"$error":"#DIV/0!"}}]
[null,"CVE",null,{"$f":"'2. P&L'!H73","v":0},{"$f":"'2. P&L'!I73","v":0},null,0,"",null,0,"",null,{"$f":"IF(ABS(E69/$E$72)>'1. Info'!$D$24,\"SIGNIFICATIF\",\"NON MATERIEL\")","v":{"$error":"#DIV/0!"}}]
[null,"Autres impôts et taxes",null,{"$f":"'2. P&L'!H74","v":0},{"$f":"'2. P&L'!I74","v":0},null,0,"",null,0,"",null,{"$f":"IF(ABS(E70/$E$72)>'1. Info'!$D$24,\"SIGNIFICATIF\",\"NON MATERIEL\")","v":{"$error":"#DIV/0!"}}]
[null,"Autres Charges d'exploitation",null,{"$f":"'2. P&L'!H75","v":0},{"$f":"'2. P&L'!I75","v":0},null,0,"",null,0,"",null,{"$f":"IF(ABS(E71/$E$72)>'1. Info'!$D$24,\"SIGNIFICATIF\",\"NON MATERIEL\")","v":{"$error":"#DIV/0!"}}]
[null,"EBITDA",null,{"$f":"'2. P&L'!H76","v":0},{"$f":"E30++E40+E46+E58+E64+E71","v":0},null,0,"",null,0,""]
[null,"marge Ebitda",null,{"$f":"'2. P&L'!H77","v":""},{"$f":"IFERROR(E72/E30,\"\")","v":""},null,null,"",null,null,""]
[null,"Dotations aux amortissements",null,{"$f":"'2. P&L'!H78","v":0},{"$f":"'2. P&L'!I78","v":0},null,{"$f":"D74-C74","v":0},"",null,{"$f":"E74-D74","v":0},"",null,{"$f":"IF(ABS(E74/$E$72)>'1. Info'!$D$24,\"SIGNIFICATIF\",\"NON MATERIEL\")","v":{"$error":"#DIV/0!"}}]
[null,"Dotations aux amortissements des immobilisations non renouvelables",null,{"$f":"'2. P&L'!H79","v":0},{"$f":"'2. P&L'!I79","v":0},null,0,"",null,0,"",null,{"$f":"IF(ABS(E75/$E$72)>'1. Info'!$D$24,\"SIGNIFICATIF\",\"NON MATERIEL\")","v":{"$error":"#DIV/0!"}}]
[null,"Dotations aux amortissements des immobilisations renouvelables",null,{"$f":"'2. P&L'!H80","v":0},{"$f":"'2. P&L'!I80","v":0},null,0,"",null,0,"",null,{"$f":"IF(ABS(E76/$E$72)>'1. Info'!$D$24,\"SIGNIFICATIF\",\"NON MATERIEL\")","v":{"$error":"#DIV/0!"}}]
[null,"Autres dotations aux amort. et prov. (net reprises)",null,{"$f":"'2. P&L'!H81","v":0},{"$f":"'2. P&L'!I81","v":0},null,0,"",null,0,"",null,{"$f":"IF(ABS(E77/$E$72)>'1. Info'!$D$24,\"SIGNIFICATIF\",\"NON MATERIEL\")","v":{"$error":"#DIV/0!"}}]
[null,"dont provision / reprise pour renouvellement des couches de chaussées",null,null,{"$f":"'2. P&L'!I82","v":0},null,0,"",null,0,"",null,{"$f":"IF(ABS(E78/$E$72)>'1. Info'!$D$24,\"SIGNIFICATIF\",\"NON MATERIEL\")","v":{"$error":"#DIV/0!"}}]
[null,"dont provision / reprise pour maintien en état des ouvrages d'art",null,null,{"$f":"'2. P&L'!I83","v":0},null,0,"",null,0,"",null,{"$f":"IF(ABS(E79/$E$72)>'1. Info'!$D$24,\"SIGNIFICATIF\",\"NON MATERIEL\")","v":{"$error":"#DIV/0!"}}]
[null,"dont provision / reprise exceptionnelle liée à la masse salariale",null,null,{"$f":"'2. P&L'!I84","v":0},null,0,"",null,0,"",null,{"$f":"IF(ABS(E80/$E$72)>'1. Info'!$D$24,\"SIGNIFICATIF\",\"NON MATERIEL\")","v":{"$error":"#DIV/0!"}}]
[null,"dont autres provisions / reprises d'exploitation",null,null,{"$f":"'2. P&L'!I85","v":0},null,0,"",null,0,"",null,{"$f":"IF(ABS(E81/$E$72)>'1. Info'!$D$24,\"SIGNIFICATIF\",\"NON MATERIEL\")","v":{"$error":"#DIV/0!"}}]
[null,"Reprises des Subventions d'investissements",null,{"$f":"'2. P&L'!H86","v":0},{"$f":"'2. P&L'!I86","v":0},null,0,"",null,0,"",null,{"$f":"IF(ABS(E82/$E$72)>'1. Info'!$D$24,\"SIGNIFICATIF\",\"NON MATERIEL\")","v":{"$error":"#DIV/0!"}}]
[null,"EBIT",null,{"$f":"'2. P&L'!H87","v":0},{"$f":"+E72+E74+E77+E82","v":0},null,0,"",null,0,""]
[null,null,null,null,null,null,null,""]
[null,"PRODUITS FINANCIERS",null,{"$f":"'2. P&L'!H89","v":0},{"$f":"SUM(E86:E90)","v":0},null,{"$f":"D85-C85","v":0},"",null,{"$f":"E85-D85","v":0},{"$f":"IFERROR(E85/D85-1,\"\")","v":""}]
[null,"Dividendes reçus",null,{"$f":"'2. P&L'!H90","v":0},{"$f":"'2. P&L'!I90","v":0},null,0,"",null,0,"",null,{"$f":"IF(ABS(E86/$E$72)>'1. Info'!$D$24,\"SIGNIFICATIF\",\"NON MATERIEL\")","v":{"$error":"#DIV/0!"}}]
[null,"dont provenant de SCA françaises",null,{"$f":"'2. P&L'!H91","v":0},{"$f":"'2. P&L'!I91","v":0},null,0,"",null,0,"",null,{"$f":"IF(ABS(E87/$E$72)>'1. Info'!$D$24,\"SIGNIFICATIF\",\"NON MATERIEL\")","v":{"$error":"#DIV/0!"}}]
[null,"dont provenant d'autres filiales françaises ou étrangères",null,{"$f":"'2. P&L'!H92","v":0},{"$f":"'2. P&L'!I92","v":0},null,0,"",null,0,"",null,{"$f":"IF(ABS(E88/$E$72)>'1. Info'!$D$24,\"SIGNIFICATIF\",\"NON MATERIEL\")","v":{"$error":"#DIV/0!"}}]
[null,"Intérêts sur créances",null,{"$f":"'2. P&L'!H93","v":0},{"$f":"'2. P&L'!I93","v":0},null,0,"",null,0,"",null,{"$f":"IF(ABS(E89/$E$72)>'1. Info'!$D$24,\"SIGNIFICATIF\",\"NON MATERIEL\")","v":{"$error":"#DIV/0!"}}]
[null,"Autres produits financiers",null,{"$f":"'2. P&L'!H94","v":0},{"$f":"'2. P&L'!I94","v":0},null,0,"",null,0,"",null,{"$f":"IF(ABS(E90/$E$72)>'1. Info'!$D$24,\"SIGNIFICATIF\",\"NON MATERIEL\")","v":{"$error":"#DIV/0!"}}]
[null,"CHARGES FINANCIERES",null,{"$f":"'2. P&L'!H95","v":0},{"$f":"+E92+E94","v":0},null,0,{"$f":"IFERROR(D91/C91-1,\"\")","v":""},null,0,""]
[null,"Charges financières sur emprunts",null,{"$f":"'2. P&L'!H96","v":0},{"$f":"'2. P&L'!I96","v":0},null,0,"",null,0,"",null,{"$f":"IF(ABS(E92/$E$72)>'1. Info'!$D$24,\"SIGNIFICATIF\",\"NON MATERIEL\")","v":{"$error":"#DIV/0!"}}]
[null,"dont prime (soulte) sur opération de refinancement",null,{"$f":"'2. P&L'!H97","v":0},{"$f":"'2. P&L'!I97","v":0},null,0,"",null,0,"",null,{"$f":"IF(ABS(E93/$E$72)>'1. Info'!$D$24,\"SIGNIFICATIF\",\"NON MATERIEL\")","v":{"$error":"#DIV/0!"}}]
[null,"Autres charges financières",null,{"$f":"'2. P&L'!H98","v":0},{"$f":"'2. P&L'!I98","v":0},null,0,"",null,0,"",null,{"$f":"IF(ABS(E94/$E$72)>'1. Info'!$D$24,\"SIGNIFICATIF\",\"NON MATERIEL\")","v":{"$error":"#DIV/0!"}}]
[null,"RESULTAT FINANCIER",null,{"$f":"'2. P&L'!H99","v":0},{"$f":"E85+E91","v":0},null,0,"",null,0,""]
[null,"Taux intérêt implicite",null,{"$f":"'2. P&L'!H100","v":""},{"$f":"'2. P&L'!I100","v":""},null,null,"",null,null,""]
[null,null,null,null,null,null,null,""]
[null,"RESULTAT COURANT",null,{"$f":"'2. P&L'!H102","v":0},{"$f":"+E83+E95","v":0},null,{"$f":"D98-C98","v":0},"",null,{"$f":"E98-D98","v":0},{"$f":"IFERROR(E98/D98-1,\"\")","v":""}]
[null,null,null,null,null,null,null,""]
[null,"RESULTAT EXCEPTIONNEL",null,{"$f":"'2. P&L'!H104","v":0},null,null,{"$f":"D100-C100","v":0},"",null,{"$f":"E100-D100","v":0},""]
[null,null,null,null,null,null,null,""]
[null,"RESULTAT AVANT IMPOTS",null,{"$f":"'2. P&L'!H106","v":0},{"$f":"+E98+E100","v":0},null,{"$f":"D102-C102","v":0},"",null,{"$f":"E102-D102","v":0},""]
[null,"Impôt sur les sociétés",null,{"$f":"'2. P&L'!H107","v":0},{"$f":"'2. P&L'!I107","v":0},null,0,"",null,{"$f":"E103-D103","v":0},"",null,{"$f":"IF(ABS(E103/$E$72)>'1. Info'!$D$24,\"SIGNIFICATIF\",\"NON MATERIEL\")","v":{"$error":"#DIV/0!"}}]
[null,"RESULTAT NET",null,{"$f":"'2. P&L'!H108","v":0},{"$f":"E102+E103","v":0},null,0,"",null,{"$f":"E104-D104","v":0},""]
[null,"marge nette",{"$f":"'2. P&L'!G109","v":""},{"$f":"'2. P&L'!H109","v":""},{"$f":"IFERROR(E104/E30,\"\")","v":""},null,null,"",null,null,""]
[null,null,null,null,null,null,null,""]
[null,"Taux IS",null,{"$f":"'2. P&L'!H111","v":0},{"$f":"'2. P&L'!I111","v":0},null,null,"",null,null,{"$f":"IFERROR(E107/D107-1,\"\")","v":""}]
[]
[null,"CASH FLOW "]
[]
[null,"( en M€ courants )  ","2016 (p) n-2","2016 (p) n-1","2016 (r)",null,"Ecart en M€","Ecart en %",null,"Ecart en M€","Ecart en %",null,"Matérialité des données"]
[null,"EBIT",null,{"$f":"'3. CF'!H5","v":0},{"$f":"'2. P&L'!I87","v":0},null,{"$f":"D112-C112","v":0},{"$f":"IFERROR(D112/C112-1,\"\")","v":""},null,{"$f":"E112-D112","v":0},{"$f":"IFERROR(E112/D112-1,\"\")","v":""},null,{"$f":"IF(ABS(E112/$E$72)>'1. Info'!$D$25,\"SIGNIFICATIF\",\"NON MATERIEL\")","v":{"$error":"#DIV/0!"}}]
[null,"Amortissements nets de subventions et provisions",null,{"$f":"'3. CF'!H6","v":0},{"$f":"'3. CF'!I6","v":0},null,0,"",null,0,"",null,{"$f":"IF(ABS(E113/$E$72)>'1. Info'!$D$25,\"SIGNIFICATIF\",\"NON MATERIEL\")","v":{"$error":"#DIV/0!"}}]
[null,"Plus-value / moins-value de cession",null,{"$f":"'3. CF'!H7","v":0},{"$f":"'3. CF'!I7","v":0},null,0,"",null,0,"",null,{"$f":"IF(ABS(E114/$E$72)>'1. Info'!$D$25,\"SIGNIFICATIF\",\"NON MATERIEL\")","v":{"$error":"#DIV/0!"}}]
[null,"Intérêts financiers nets payés",null,{"$f":"'3. CF'!H8","v":0},{"$f":"'3. CF'!I8","v":0},null,0,"",null,0,"",null,{"$f":"IF(ABS(E115/$E$72)>'1. Info'!$D$25,\"SIGNIFICATIF\",\"NON MATERIEL\")","v":{"$error":"#DIV/0!"}}]
[null,"Impôts payés",null,{"$f":"'3. CF'!H9","v":0},{"$f":"'3. CF'!I9","v":0},null,0,"",null,0,"",null,{"$f":"IF(ABS(E116/$E$72)>'1. Info'!$D$25,\"SIGNIFICATIF\",\"NON MATERIEL\")","v":{"$error":"#DIV/0!"}}]
[null,"Revenus des titres de participation",null,{"$f":"'3. CF'!H10","v":0},{"$f":"'3. CF'!I10","v":0},null,0,"",null,0,"",null,{"$f":"IF(ABS(E117/$E$72)>'1. Info'!$D$25,\"SIGNIFICATIF\",\"NON MATERIEL\")","v":{"$error":"#DIV/0!"}}]
[null,"Variation du BFR",null,{"$f":"'3. CF'!H11","v":0},{"$f":"'3. CF'!I11","v":0},null,0,"",null,0,"",null,{"$f":"IF(ABS(E118/$E$72)>'1. Info'!$D$25,\"SIGNIFICATIF\",\"NON MATERIEL\")","v":{"$error":"#DIV/0!"}}]
[null,"CASH FLOW OPERATIONNELS /FFO",null,{"$f":"'3. CF'!H12","v":0},{"$f":"+SUM(E112:E118)","v":0},null,0,"",null,0,""]
[null,"Acquisitions d’immobilisations",null,{"$f":"'3. CF'!H13","v":0},{"$f":"'3. CF'!I13","v":0},null,0,"",null,0,"",null,{"$f":"IF(ABS(E120/$E$72)>'1. Info'!$D$25,\"SIGNIFICATIF\",\"NON MATERIEL\")","v":{"$error":"#DIV/0!"}}]
[null,"- Immobilisations non renouvelables ou ICAS",null,{"$f":"'3. CF'!H14","v":0},{"$f":"'3. CF'!I14","v":0},null,0,"",null,0,"",null,{"$f":"IF(ABS(E121/$E$72)>'1. Info'!$D$25,\"SIGNIFICATIF\",\"NON MATERIEL\")","v":{"$error":"#DIV/0!"}}]
[null,"- Immobilisations  renouvelables ou IEAS",null,{"$f":"'3. CF'!H15","v":0},{"$f":"'3. CF'!I15","v":0},null,0,"",null,0,"",null,{"$f":"IF(ABS(E122/$E$72)>'1. Info'!$D$25,\"SIGNIFICATIF\",\"NON MATERIEL\")","v":{"$error":"#DIV/0!"}}]
[null,"Cessions d’immobilisations",null,{"$f":"'3. CF'!H16","v":0},{"$f":"'3. CF'!I16","v":0},null,0,"",null,0,"",null,{"$f":"IF(ABS(E123/$E$72)>'1. Info'!$D$25,\"SIGNIFICATIF\",\"NON MATERIEL\")","v":{"$error":"#DIV/0!"}}]
[null,"Acquisition  / cession d'Immobilisations financières",null,{"$f":"'3. CF'!H17","v":0},{"$f":"'3. CF'!I17","v":0},null,0,"",null,0,"",null,{"$f":"IF(ABS(E124/$E$72)>'1. Info'!$D$25,\"SIGNIFICATIF\",\"NON MATERIEL\")","v":{"$error":"#DIV/0!"}}]
[null,"FLUX NETS DE TRESORERIE LIES AUX\nOPERATIONS D'INVESTISSEMENTS",null,{"$f":"'3. CF'!H18","v":0},{"$f":"'3. CF'!I18","v":0},null,0,"",null,0,""]
[null,"Dividendes versés",null,{"$f":"'3. CF'!H19","v":0},{"$f":"'3. CF'!I19","v":0},null,0,"",null,0,"",null,{"$f":"IF(ABS(E126/$E$72)>'1. Info'!$D$25,\"SIGNIFICATIF\",\"NON MATERIEL\")","v":{"$error":"#DIV/0!"}}]
[null,"dont dividende au titre du résultat de l'exercice N-1",null,{"$f":"'3. CF'!H20","v":0},{"$f":"'3. CF'!I20","v":0},null,0,"",null,0,"",null,{"$f":"IF(ABS(E127/$E$72)>'1. Info'!$D$25,\"SIGNIFICATIF\",\"NON MATERIEL\")","v":{"$error":"#DIV/0!"}}]
[null,"dont acompte sur dividende",null,{"$f":"'3. CF'!H21","v":0},{"$f":"'3. CF'!I21","v":0},null,0,"",null,0,"",null,{"$f":"IF(ABS(E128/$E$72)>'1. Info'!$D$25,\"SIGNIFICATIF\",\"NON MATERIEL\")","v":{"$error":"#DIV/0!"}}]
[null,"Subventions d'investissement reçues",null,{"$f":"'3. CF'!H22","v":0},{"$f":"'3. CF'!I22","v":0},null,0,"",null,0,"",null,{"$f":"IF(ABS(E129/$E$72)>'1. Info'!$D$25,\"SIGNIFICATIF\",\"NON MATERIEL\")","v":{"$error":"#DIV/0!"}}]
[null,"Emission Nouveaux Emprunts",null,{"$f":"'3. CF'!H23","v":0},{"$f":"'3. CF'!I23","v":0},null,0,"",null,0,"",null,{"$f":"IF(ABS(E130/$E$72)>'1. Info'!$D$25,\"SIGNIFICATIF\",\"NON MATERIEL\")","v":{"$error":"#DIV/0!"}}]
[null,"Remboursement emprunts",null,{"$f":"'3. CF'!H24","v":0},{"$f":"'3. CF'!I24","v":0},null,0,"",null,0,"",null,{"$f":"IF(ABS(E131/$E$72)>'1. Info'!$D$25,\"SIGNIFICATIF\",\"NON MATERIEL\")","v":{"$error":"#DIV/0!"}}]
[null,"Prime  sur opération de refinancement",null,{"$f":"'3. CF'!H25","v":0},{"$f":"'3. CF'!I25","v":0},null,0,"",null,0,"",null,{"$f":"IF(ABS(E132/$E$72)>'1. Info'!$D$25,\"SIGNIFICATIF\",\"NON MATERIEL\")","v":{"$error":"#DIV/0!"}}]
[null,"Opérations en capital",null,{"$f":"'3. CF'!H26","v":0},{"$f":"'3. CF'!I26","v":0},null,0,"",null,0,"",null,{"$f":"IF(ABS(E133/$E$72)>'1. Info'!$D$25,\"SIGNIFICATIF\",\"NON MATERIEL\")","v":{"$error":"#DIV/0!"}}]
[null,"Opérations sur comptes de réserve",null,{"$f":"'3. CF'!H27","v":0},{"$f":"'3. CF'!I27","v":0},null,0,"",null,0,"",null,{"$f":"IF(ABS(E134/$E$72)>'1. Info'!$D$25,\"SIGNIFICATIF\",\"NON MATERIEL\")","v":{"$error":"#DIV/0!"}}]
[null,"FLUX NETS DE TRESORERIE LIES AUX\nOPERATIONS DE FINANCEMENT",null,{"$f":"'3. CF'!H28","v":0},{"$f":"+E126+E129+E130+E131+E132+E133+E134","v":0},null,{"$f":"D135-C135","v":0},"",null,0,""]
[null,null,null,{"$f":"'3. CF'!H29","v":0},null,null,null,"",null,null,""]
[null,"VARIATION DE TRESORERIE",null,{"$f":"'3. CF'!H30","v":0},{"$f":"E135+E125+E119","v":0},null,{"$f":"D137-C137","v":0},"",null,{"$f":"E137-D137","v":0},""]
[null,null,null,null,null,null,null,"",null,null,""]
[null,"TRESORERIE D'OUVERTURE",null,{"$f":"'3. CF'!H32","v":0},{"$f":"'3. CF'!G33","v":0},null,{"$f":"D139-C139","v":0},"",null,{"$f":"E139-D139","v":0},""]
[null,"TRESORERIE DE CLOTURE",null,{"$f":"'3. CF'!H33","v":0},{"$f":"E139+E137","v":0},null,{"$f":"D140-C140","v":0},"",null,0,""]
[]
[null,"Bilan"]
[]
[null,"( en M€ courants)  ","2016 (p) n-2","2016 (p) n-1","2016 (r)",null,"Ecart en M€","Ecart en %",null,"Ecart en M€","Ecart en %",null,"Matérialité des données"]
[null,"ACTIF",null,{"$f":"'4. Bilan & ratios'!H5","v":0},{"$f":"E147+E156","v":0},null,{"$f":"D145-C145","v":0},{"$f":"IFERROR(D145/C145-1,\"\")","v":""},null,{"$f":"E145-D145","v":0},{"$f":"IFERROR(E145/D145-1,\"\")","v":""}]
[null,null,null,null,null,null,null,""]
[null,"Actif immobilisé",null,{"$f":"'4. Bilan & ratios'!H7","v":0},{"$f":"E148+E149+E150","v":0},null,{"$f":"D147-C147","v":0},"",null,{"$f":"E147-D147","v":0},{"$f":"IFERROR(E147/D147-1,\"\")","v":""}]
[null,"Immobilisations incorporelles (nettes)",null,{"$f":"'4. Bilan & ratios'!H8","v":0},{"$f":"'4. Bilan & ratios'!I8","v":0},null,0,"",null,0,"",null,{"$f":"IF(ABS(E148/$E$145)>'1. Info'!$D$26,\"SIGNIFICATIF\",\"NON MATERIEL\")","v":{"$error":"#DIV/0!"}}]
[null,"Immobilisations corporelles  du domaine concédé (nettes)",null,{"$f":"'4. Bilan & ratios'!H9","v":0},{"$f":"'4. Bilan & ratios'!I9","v":0},null,0,"",null,0,"",null,{"$f":"IF(ABS(E149/$E$145)>'1. Info'!$D$26,\"SIGNIFICATIF\",\"NON MATERIEL\")","v":{"$error":"#DIV/0!"}}]
[null,"Immobilisations financières (nettes)",null,{"$f":"'4. Bilan & ratios'!H10","v":0},{"$f":"'4. Bilan & ratios'!I10","v":0},null,0,"",null,0,"",null,{"$f":"IF(ABS(E150/$E$145)>'1. Info'!$D$26,\"SIGNIFICATIF\",\"NON MATERIEL\")","v":{"$error":"#DIV/0!"}}]
[null,"dont titres de participations dans sociétés consolidées",null,null,{"$f":"'4. Bilan & ratios'!I11","v":0},null,0,"",null,0,"",null,{"$f":"IF(ABS(E151/$E$145)>'1. Info'!$D$26,\"SIGNIFICATIF\",\"NON MATERIEL\")","v":{"$error":"#DIV/0!"}}]
[null,"dont titres de participations dans sociétés mises en équivalences",null,null,{"$f":"'4. Bilan & ratios'!I12","v":0},null,0,"",null,0,"",null,{"$f":"IF(ABS(E152/$E$145)>'1. Info'!$D$26,\"SIGNIFICATIF\",\"NON MATERIEL\")","v":{"$error":"#DIV/0!"}}]
[null,"dont créances rattachées à des participations",null,null,{"$f":"'4. Bilan & ratios'!I13","v":0},null,0,"",null,0,"",null,{"$f":"IF(ABS(E153/$E$145)>'1. Info'!$D$26,\"SIGNIFICATIF\",\"NON MATERIEL\")","v":{"$error":"#DIV/0!"}}]
[null,"dont prêts",null,null,{"$f":"'4. Bilan & ratios'!I14","v":0},null,0,"",null,0,"",null,{"$f":"IF(ABS(E154/$E$145)>'1. Info'!$D$26,\"SIGNIFICATIF\",\"NON MATERIEL\")","v":{"$error":"#DIV/0!"}}]
[null,"dont autre",null,null,{"$f":"'4. Bilan & ratios'!I15","v":0},null,0,"",null,0,"",null,{"$f":"IF(ABS(E155/$E$145)>'1. Info'!$D$26,\"SIGNIFICATIF\",\"NON MATERIEL\")","v":{"$error":"#DIV/0!"}}]
[null,"Actif circulant",null,{"$f":"'4. Bilan & ratios'!H16","v":0},{"$f":"SUM(E157:E161)","v":0},null,0,"",null,0,""]
[null,"Stocks",null,null,{"$f":"'4. Bilan & ratios'!I17","v":0},null,0,"",null,0,"",null,{"$f":"IF(ABS(E157/$E$145)>'1. Info'!$D$26,\"SIGNIFICATIF\",\"NON MATERIEL\")","v":{"$error":"#DIV/0!"}}]
[null,"Créances clients ",null,null,{"$f":"'4. Bilan & ratios'!I18","v":0},null,0,"",null,0,"",null,{"$f":"IF(ABS(E158/$E$145)>'1. Info'!$D$26,\"SIGNIFICATIF\",\"NON MATERIEL\")","v":{"$error":"#DIV/0!"}}]
[null,"Créances sociales et fiscales",null,null,{"$f":"'4. Bilan & ratios'!I19","v":0},null,0,"",null,0,"",null,{"$f":"IF(ABS(E159/$E$145)>'1. Info'!$D$26,\"SIGNIFICATIF\",\"NON MATERIEL\")","v":{"$error":"#DIV/0!"}}]
[null,"Autres créances et comptes de régularisation",null,{"$f":"'4. Bilan & ratios'!H20","v":0},{"$f":"'4. Bilan & ratios'!I20","v":0},null,0,"",null,0,"",null,{"$f":"IF(ABS(E160/$E$145)>'1. Info'!$D$26,\"SIGNIFICATIF\",\"NON MATERIEL\")","v":{"$error":"#DIV/0!"}}]
[null,"Trésorerie",null,{"$f":"'4. Bilan & ratios'!H21","v":0},{"$f":"'4. Bilan & ratios'!I21","v":0},null,0,"",null,0,"",null,{"$f":"IF(ABS(E161/$E$145)>'1. Info'!$D$26,\"SIGNIFICATIF\",\"NON MATERIEL\")","v":{"$error":"#DIV/0!"}}]
[null,"dont comptes de réserve",null,null,{"$f":"'4. Bilan & ratios'!I22","v":0},null,null,"",null,null,"",null,{"$f":"IF(ABS(E162/$E$145)>'1. Info'!$D$26,\"SIGNIFICATIF\",\"NON MATERIEL\")","v":{"$error":"#DIV/0!"}}]
[null,null,null,null,null,null,null,""]
[null,"PASSIF",null,{"$f":"'4. Bilan & ratios'!H25","v":0},{"$f":"+E166+E173+E174+E179+E188","v":0},null,{"$f":"D164-C164","v":0},"",null,{"$f":"E164-D164","v":0},{"$f":"IFERROR(E164/D164-1,\"\")","v":""}]
[null,null,null,{"$f":"'4. Bilan & ratios'!H26","v":0},null,null,null,""]
[null,"Capitaux propres",null,{"$f":"'4. Bilan & ratios'!H27","v":0},{"$f":"SUM(E167:E172)","v":0},null,{"$f":"D166-C166","v":0},"",null,{"$f":"E166-D166","v":0},{"$f":"IFERROR(E166/D166-1,\"\")","v":""}]
[null,"Capital social",null,{"$f":"'4. Bilan & ratios'!H28","v":0},{"$f":"'4. Bilan & ratios'!I28","v":0},null,0,"",null,0,"",null,{"$f":"IF(ABS(E167/$E$145)>'1. Info'!$D$26,\"SIGNIFICATIF\",\"NON MATERIEL\")","v":{"$error":"#DIV/0!"}}]
[null,"Primes et réserves",null,{"$f":"'4. Bilan & ratios'!H29","v":0},{"$f":"'4. Bilan & ratios'!I29","v":0},null,0,"",null,0,"",null,{"$f":"IF(ABS(E168/$E$145)>'1. Info'!$D$26,\"SIGNIFICATIF\",\"NON MATERIEL\")","v":{"$error":"#DIV/0!"}}]
[null,"Report à nouveau",null,{"$f":"'4. Bilan & ratios'!H30","v":0},{"$f":"'4. Bilan & ratios'!I30","v":0},null,0,"",null,0,"",null,{"$f":"IF(ABS(E169/$E$145)>'1. Info'!$D$26,\"SIGNIFICATIF\",\"NON MATERIEL\")","v":{"$error":"#DIV/0!"}}]
[null,"Résultat de l'exercice",null,{"$f":"'4. Bilan & ratios'!H31","v":0},{"$f":"'4. Bilan & ratios'!I31","v":0},null,0,"",null,0,"",null,{"$f":"IF(ABS(E170/$E$145)>'1. Info'!$D$26,\"SIGNIFICATIF\",\"NON MATERIEL\")","v":{"$error":"#DIV/0!"}}]
[null,"Subventions d'investissement",null,{"$f":"'4. Bilan & ratios'!H32","v":0},{"$f":"'4. Bilan & ratios'!I32","v":0},null,0,"",null,0,"",null,{"$f":"IF(ABS(E171/$E$145)>'1. Info'!$D$26,\"SIGNIFICATIF\",\"NON MATERIEL\")","v":{"$error":"#DIV/0!"}}]
[null,"Provisions réglementées",null,{"$f":"'4. Bilan & ratios'!H33","v":0},{"$f":"'4. Bilan & ratios'!I33","v":0},null,0,"",null,0,"",null,{"$f":"IF(ABS(E172/$E$145)>'1. Info'!$D$26,\"SIGNIFICATIF\",\"NON MATERIEL\")","v":{"$error":"#DIV/0!"}}]
[null,"Autres Fonds Propres",null,{"$f":"'4. Bilan & ratios'!H34","v":0},{"$f":"'4. Bilan & ratios'!I34","v":0},null,0,"",null,0,"",null,{"$f":"IF(ABS(E173/$E$145)>'1. Info'!$D$26,\"SIGNIFICATIF\",\"NON MATERIEL\")","v":{"$error":"#DIV/0!"}}]
[null,"Provisions pour risques et charges",null,{"$f":"'4. Bilan & ratios'!H35","v":0},{"$f":"SUM(E175:E178)","v":0},null,0,"",null,0,""]
[null,"dont provisions pour indemnités de fin de carrière",null,null,{"$f":"'4. Bilan & ratios'!I36","v":0},null,0,"",null,0,"",null,{"$f":"IF(ABS(E175/$E$145)>'1. Info'!$D$26,\"SIGNIFICATIF\",\"NON MATERIEL\")","v":{"$error":"#DIV/0!"}}]
[null,"dont provisions pour gros entretien",null,null,{"$f":"'4. Bilan & ratios'!I37","v":0},null,0,"",null,0,"",null,{"$f":"IF(ABS(E176/$E$145)>'1. Info'!$D$26,\"SIGNIFICATIF\",\"NON MATERIEL\")","v":{"$error":"#DIV/0!"}}]
[null,"dont provisions pour indexation d'emprunts",null,null,{"$f":"'4. Bilan & ratios'!I38","v":0},null,0,"",null,0,"",null,{"$f":"IF(ABS(E177/$E$145)>'1. Info'!$D$26,\"SIGNIFICATIF\",\"NON MATERIEL\")","v":{"$error":"#DIV/0!"}}]
[null,"dont autres provisions pour risques et charges",null,null,{"$f":"'4. Bilan & ratios'!I39","v":0},null,0,"",null,0,"",null,{"$f":"IF(ABS(E178/$E$145)>'1. Info'!$D$26,\"SIGNIFICATIF\",\"NON MATERIEL\")","v":{"$error":"#DIV/0!"}}]
[null,"Emprunts et dettes financières",null,{"$f":"'4. Bilan & ratios'!H40","v":0},{"$f":"SUM(E180:E187)","v":0},null,0,"",null,0,""]
[null,"dont emprunts ",null,null,{"$f":"'4. Bilan & ratios'!I41","v":0},null,0,"",null,0,"",null,{"$f":"IF(ABS(E180/$E$145)>'1. Info'!$D$26,\"SIGNIFICATIF\",\"NON MATERIEL\")","v":{"$error":"#DIV/0!"}}]
[null,"dont ligne de crédit externe",null,null,{"$f":"'4. Bilan & ratios'!I42","v":0},null,0,"",null,0,"",null,{"$f":"IF(ABS(E181/$E$145)>'1. Info'!$D$26,\"SIGNIFICATIF\",\"NON MATERIEL\")","v":{"$error":"#DIV/0!"}}]
[null,"dont ligne de crédit intragroupe",null,null,{"$f":"'4. Bilan & ratios'!I43","v":0},null,null,"",null,null,"",null,{"$f":"IF(ABS(E182/$E$145)>'1. Info'!$D$26,\"SIGNIFICATIF\",\"NON MATERIEL\")","v":{"$error":"#DIV/0!"}}]
[null,"dont dettes de trésorerie",null,null,{"$f":"'4. Bilan & ratios'!I44","v":0},null,{"$f":"D183-C183","v":0},"",null,0,"",null,{"$f":"IF(ABS(E183/$E$145)>'1. Info'!$D$26,\"SIGNIFICATIF\",\"NON MATERIEL\")","v":{"$error":"#DIV/0!"}}]
[null,"dont prêt intragroupe / C/C associés",null,null,{"$f":"'4. Bilan & ratios'!I45","v":0},null,0,"",null,0,"",null,{"$f":"IF(ABS(E184/$E$145)>'1. Info'!$D$26,\"SIGNIFICATIF\",\"NON MATERIEL\")","v":{"$error":"#DIV/0!"}}]
[null,"dont ICNE",null,null,{"$f":"'4. Bilan & ratios'!I46","v":0},null,0,"",null,0,"",null,{"$f":"IF(ABS(E185/$E$145)>'1. Info'!$D$26,\"SIGNIFICATIF\",\"NON MATERIEL\")","v":{"$error":"#DIV/0!"}}]
[null,"dont C/C de cash pooling",null,null,{"$f":"'4. Bilan & ratios'!I47","v":0},null,0,"",null,0,"",null,{"$f":"IF(ABS(E186/$E$145)>'1. Info'!$D$26,\"SIGNIFICATIF\",\"NON MATERIEL\")","v":{"$error":"#DIV/0!"}}]
[null,"dont autres",null,null,{"$f":"'4. Bilan & ratios'!I48","v":0},null,0,"",null,0,"",null,{"$f":"IF(ABS(E187/$E$145)>'1. Info'!$D$26,\"SIGNIFICATIF\",\"NON MATERIEL\")","v":{"$error":"#DIV/0!"}}]
[null,"Passif circulant",null,{"$f":"'4. Bilan & ratios'!H49","v":0},{"$f":"SUM(E189:E192)","v":0},null,0,"",null,0,""]
[null,"Dettes sur immobilisations",null,null,{"$f":"'4. Bilan & ratios'!I50","v":0},null,0,"",null,0,"",null,{"$f":"IF(ABS(E189/$E$145)>'1. Info'!$D$26,\"SIGNIFICATIF\",\"NON MATERIEL\")","v":{"$error":"#DIV/0!"}}]
[null,"Dettes fournisseurs",null,null,{"$f":"'4. Bilan & ratios'!I51","v":0},null,0,"",null,0,"",null,{"$f":"IF(ABS(E190/$E$145)>'1. Info'!$D$26,\"SIGNIFICATIF\",\"NON MATERIEL\")","v":{"$error":"#DIV/0!"}}]
[null,"Dettes fiscales et sociales",null,null,{"$f":"'4. Bilan & ratios'!I52","v":0},null,0,"",null,0,"",null,{"$f":"IF(ABS(E191/$E$145)>'1. Info'!$D$26,\"SIGNIFICATIF\",\"NON MATERIEL\")","v":{"$error":"#DIV/0!"}}]
[null,"Autres dettes",null,null,{"$f":"'4. Bilan & ratios'!I53","v":0},null,0,"",null,0,"",null,{"$f":"IF(ABS(E192/$E$145)>'1. Info'!$D$26,\"SIGNIFICATIF\",\"NON MATERIEL\")","v":{"$error":"#DIV/0!"}}]